program: Gaussian 09
title: 000096952
version: EM64L-G09RevD.01
frameworkgroup: C1[X(C7H8FNO3S)]
method: RPBEPBE
basis: SDD
operation: Freq
keyword: #p
keyword: freq=noraman
keyword: PBEPBE/SDD
title: #p freq=noraman PBEPBE/SDD
converged: NO NO NO NO
title: Mulliken charges:
elementType: S F O O O N C C C C C C C H H H H H H H H
charge: 1.082766 -0.353965 -0.294194 -0.490527 -0.487050 -0.681946 -0.092786 0.371230 -0.373389 0.210031 -0.270783 -0.291459 -0.530821 0.284175 0.283506 0.253685 0.346412 0.320673 0.233138 0.249667 0.231638
chargesum: 0.00000
title: Mulliken charges with hydrogens summed into heavy atoms:
elementType: S F O O O N C C C C C C C
charge: 1.082766 -0.353965 -0.294194 -0.490527 -0.487050 -0.014861 -0.092786 0.371230 -0.089213 0.210031 0.012722 -0.037775 0.183622
polarizability: 1.87272731e+02 1.63676236e+00 1.29331847e+02 4.21003579e+00 3.45343248e-01 6.61366639e+01
1716.lowfreq: -14.8536 -8.1535 -3.9206 -0.0024 -0.0024 0.0006 25.7216 62.4022 111.4229
frequency: 24.1065 62.3928 111.4192 118.0958 159.8241 195.5656 207.4028 227.7064 233.4611 246.4365 300.9567 305.9492 362.7507 367.7367 417.5078 427.5471 444.6619 501.3253 509.1674 529.7361 547.6021 579.1685 612.0695 730.0967 735.7666 792.7587 842.6613 853.4455 872.6622 917.0684 983.7059 995.9616 1026.6429 1075.6207 1117.2827 1136.1573 1161.9984 1217.3991 1276.5967 1298.0805 1419.2639 1436.5640 1443.4029 1469.5470 1473.9611 1515.8084 1574.6343 1605.3406 1636.4265 2973.8217 3067.3366 3134.8291 3154.7510 3163.7237 3183.0718 3561.1267 3707.0405
redmass: 7.4213 5.3772 4.7443 7.4480 4.3313 4.5060 6.0860 7.6929 1.2459 5.3392 8.7799 5.3304 4.6348 5.1389 1.3414 8.4486 2.4403 5.3130 1.1703 8.2958 4.6173 5.7091 7.5394 3.6235 3.6438 1.5238 10.3641 1.5422 8.7870 1.3339 8.2974 14.0281 1.8602 1.7079 1.2577 1.3466 1.3791 3.9579 1.3135 2.6095 3.2316 2.2758 1.7903 1.0490 1.0691 3.7442 6.1411 2.0661 2.0669 1.0323 1.1046 1.1007 1.0924 1.0881 1.0968 1.0448 1.1045
irintensity: 0.0562 0.1454 6.3576 2.0333 6.3779 9.3138 0.9740 1.4267 1.3839 0.7839 6.9802 7.3966 8.7822 5.4426 123.2114 102.2810 2.2636 8.4668 162.6160 91.5622 61.7234 49.8802 13.9863 5.9487 2.8776 47.5192 53.3530 37.8776 76.1288 0.3294 26.4730 97.3733 14.0519 32.8181 0.1455 52.8366 13.1301 210.8638 1.6513 82.7795 6.2975 0.1884 22.1969 16.3844 52.6903 209.5365 32.0990 2.2909 297.3091 59.4585 36.9507 17.4027 6.2602 6.4961 7.2222 111.4323 41.4282
temp: 298.150 k
press: 1.00000 atm
elementType: 16 9 8 8 8 7 6 6 6 6 6 6 6 1 1 1 1 1 1 1 1
symmnumber: 1
zpe: 383087.0 jmol-1
zpe.correction: 0.145910 hartree
zpe.thermalcorrener: 0.159453 hartree
zpe.thermalcorrenthalpy: 0.160397 hartree
zpe.thermalcorrgfe: 0.105237 hartree
zpe.sumelectzpe: -1048.719492 hartree
zpe.sumelectthermal: -1048.705949 hartree
zpe.sumelectthermalent: -1048.705004 hartree
zpe.sumelectthermalfe: -1048.760165 hartree
dipole: 9.8697 0.2438 -0.4942
dipole: 9.8851
quadrupole: -84.8839 -70.9395 -90.4005
quadrupole: -3.5915 1.0004 0.0768
quadrupole: -2.8093 11.1351 -8.3259 -3.5915 1.0004 0.0768
hfenergy: -1048.8654019 hartree
pointgroup: C01 [X(C7H8F1N1O3S1)]
dipole: -3.8591694 -0.2189096 -0.4287915 debye
dipolederiv: 2.3015114 0.0110529 0.0686604 -0.0006499 1.1981371 0.0618214 0.2145357 0.0560157 1.6112059 -0.5917586 -0.0103186 -0.0545411 -0.0548526 -0.3375037 -0.0844422 -0.4398554 -0.0807186 -0.9230619 -1.8992051 0.365209 -0.1260473 0.1842622 -0.3867157 0.0226084 -0.0925968 0.0303223 -0.3001687 -0.7034928 0.0329185 0.0028953 0.1684369 -0.5719208 -0.0504205 0.0236416 -0.0183448 -0.4260131 -0.7239151 -0.0507405 0.0138319 -0.1669215 -0.5204799 0.0789222 0.0837782 0.05224 -0.4509515 -0.5734924 -0.60379 0.1019291 -0.7096849 -1.1045897 0.0305034 0.1280865 0.0347692 -0.6993654 -0.4681729 0.1530873 -0.0398493 0.0182343 0.1448689 -0.0409746 0.2614351 -0.047154 -0.1154808 0.0938463 0.8278765 -0.1342995 1.0163054 1.0593275 -0.1016058 -0.2116448 -0.1179135 0.1410463 -0.0931447 -0.5108114 0.0758285 0.3508776 -0.192516 0.0163948 -0.1217556 0.0011406 -0.1724898 1.667668 -0.092471 0.0784945 -0.1173799 -0.2311955 0.0381775 0.0684166 0.0431415 0.0482113 -0.0425368 -0.040701 0.0094996 -0.299735 -0.192658 -0.0034132 -0.0122161 -0.0020587 -0.1443262 -0.2155809 0.036321 -0.0120578 -0.1734921 0.0740215 -0.0445968 0.0447066 -0.0334369 -0.1430386 0.6807383 -0.1976222 0.0476186 -0.5653761 0.4586711 -0.0473968 0.1027064 -0.0319081 0.3232479 0.1087163 0.0476102 -0.0068423 0.0086351 0.0372374 0.0221705 0.015975 0.0159197 0.17359 0.0945786 -0.0518753 0.0090193 -0.0267106 0.079755 0.0138178 -0.0098093 0.0205317 0.1691252 0.007321 0.0819109 -0.0192796 0.0864461 0.0030553 0.031461 -0.00401 0.0308607 0.1622525 0.2522086 0.0672497 -0.0160203 0.0193454 0.2279805 0.027317 0.0063479 0.0304259 0.3826556 0.1271666 0.0175997 -0.0135491 0.0577234 0.253503 0.0243468 -0.0252452 0.0226617 0.3796378 0.0599186 -0.0407216 -0.0607597 0.1419589 -0.0661877 -0.0837518 -0.0194681 -0.1041973 -0.0440453 -0.1330896 -0.0146482 -0.0093109 -0.0710147 0.0726425 0.0055514 0.0006409 0.0080236 0.1273384 0.0507152 -0.0271359 0.0847798 0.1335921 -0.0054328 0.0835095 -0.0136693 0.0896793 -0.0993696 unknown
polarizability: 187.2276694|3.0570844|127.7878226|3.6075515|-9.9368153|67.7257496 unknown
InChI: InChI=1S/C7H8FNO3S/c1-12-7-3-2-5(4-6(7)9)13(8,10)11/h2-4H,9H2,1H3
charge 0 multiplicity 1
21 atoms
S  2.737992 0.055582 -0.050285
F  2.947612 0.3207 1.787873
O  -3.260624 -0.157912 -0.23382
O  3.33987 -1.407097 -0.333522
O  3.333702 1.375851 -0.744364
N  -1.900952 -2.399975 0.174035
C  0.884617 0.039326 -0.114457
C  -1.166971 -1.238295 0.018036
C  0.246972 -1.200674 0.068869
C  -1.870234 -0.001045 -0.210512
C  0.227225 1.257348 -0.335852
C  -1.185962 1.216683 -0.387827
C  -4.088088 1.031113 -0.464253
H  0.831741 -2.112272 0.228451
H  0.782042 2.189024 -0.47156
H  -1.737363 2.144683 -0.562267
H  -2.91554 -2.35129 0.124351
H  -1.447462 -3.292699 0.342179
H  -3.941663 1.778001 0.338192
H  -5.125603 0.667944 -0.45082
H  -3.860211 1.483906 -1.447744
