program: Gaussian 09
title: 000097077
version: EM64L-G09RevD.01
frameworkgroup: C1[X(C19H16N2O5)]
method: RPBEPBE
basis: SDD
operation: Freq
keyword: #p
keyword: freq=noraman
keyword: PBEPBE/SDD
title: #p freq=noraman PBEPBE/SDD
converged: YES YES NO NO
title: Mulliken charges:
elementType: O O O O O N N C C C C C C C C C C C C C C C C C C C H H H H H H H H H H H H H H H H
charge: -0.196079 -0.217341 -0.236872 -0.438565 -0.211407 -0.212570 -0.397501 -0.142820 -0.607712 -0.534880 0.184537 0.189295 0.108439 0.140236 0.298705 0.520218 -0.351766 -0.353551 0.162137 -0.364083 -0.419094 -0.210436 -0.210353 -0.227914 -0.221812 -0.244255 0.313082 0.242017 0.220974 0.281301 0.250179 0.326981 0.269861 0.266500 0.238772 0.231840 0.239146 0.238552 0.238184 0.222746 0.224526 0.390783
chargesum: 0.00000
title: Mulliken charges with hydrogens summed into heavy atoms:
elementType: O O O O O N N C C C C C C C C C C C C C C C C C C C
charge: -0.196079 -0.217341 -0.236872 -0.047782 -0.211407 -0.212570 -0.070520 0.170262 -0.144720 -0.003400 0.184537 0.189295 0.108439 0.140236 0.298705 0.520218 -0.081905 -0.087050 0.162137 -0.125312 -0.187254 0.028710 0.028199 0.010270 0.000934 -0.019730
polarizability: 2.81656371e+02 3.58721886e+01 2.41347641e+02 -1.29741853e+01 -1.82243528e-01 1.62687567e+02
1716.lowfreq: -9.4760 -3.9003 -0.0008 -0.0004 0.0003 4.0562 11.4517 13.7648 29.3990
frequency: 11.2719 13.2655 29.3356 31.9886 36.1761 51.1929 57.1524 72.4742 86.7990 109.5939 129.0696 141.1455 153.0465 183.2201 224.0020 233.5408 250.6043 276.8139 290.0360 309.8876 329.7096 343.6741 394.3673 403.7104 414.4188 456.0281 469.9168 493.9997 521.1903 526.8507 544.2474 556.4607 578.0599 593.1255 603.5671 613.8000 617.0449 658.5620 682.3040 685.3128 691.9763 703.6875 705.2824 746.8153 760.6739 787.3305 797.0717 801.3475 834.3405 850.7986 858.8030 869.7422 906.4113 919.1285 922.5321 944.0931 973.8821 974.4988 977.7154 989.7815 994.2930 1000.0579 1005.9704 1020.0767 1025.5428 1071.5449 1074.9653 1081.5446 1089.3103 1102.3224 1169.6360 1171.5876 1173.0184 1187.2116 1188.7612 1210.8664 1215.2388 1227.8202 1258.7449 1284.3597 1290.0696 1309.9091 1313.0201 1316.9398 1333.1604 1342.1245 1369.7169 1384.8126 1416.4282 1430.9551 1440.5913 1454.7582 1455.6387 1464.0549 1482.6526 1496.7774 1593.9326 1614.3258 1614.7941 1620.5679 1631.2135 1642.3580 1672.0501 1681.9015 2992.8868 3003.2421 3049.9706 3062.9069 3067.8823 3115.2824 3128.1981 3137.7036 3139.9608 3149.6433 3153.8697 3165.9277 3166.8342 3175.4198 3524.3946 3544.3048
redmass: 6.6071 4.9984 8.3059 7.7571 6.8225 4.3370 5.5146 7.7130 5.8786 7.8639 6.2575 5.2467 7.8285 7.0293 3.7776 5.1917 4.5799 6.0610 4.7166 2.8156 7.6284 8.7956 2.4556 2.7874 3.2254 4.8701 4.5429 3.9866 5.0183 4.9157 4.5364 3.6228 1.6148 1.6707 6.6935 2.2782 5.9763 4.8201 6.9173 5.1694 3.9370 1.9943 3.1592 3.3751 1.9193 5.1625 1.9528 4.2949 4.4616 1.3077 2.9275 2.7161 1.4058 2.7928 2.0260 3.3383 1.4100 1.4026 5.9441 3.8050 1.6050 2.6841 1.3499 2.0172 2.1405 2.5548 2.6061 2.1432 2.2011 2.3544 1.1546 1.1200 1.8167 1.1793 1.2460 3.1661 2.5833 2.0743 1.3197 1.4824 1.6767 1.3903 1.3468 1.4496 1.3479 1.7117 4.9452 7.3228 5.2410 1.1520 2.1328 2.4825 2.7894 1.1468 2.3409 1.7570 6.0280 6.3064 7.6591 7.9022 11.5722 7.6314 9.2345 11.7179 1.0604 1.0579 1.0895 1.0970 1.1035 1.0869 1.0873 1.0908 1.0864 1.0965 1.0907 1.0956 1.1009 1.1003 1.0643 1.0773
irintensity: 0.1240 0.6525 3.4710 0.4643 1.4336 0.6326 1.5269 5.3962 0.3032 5.0552 0.4923 0.2168 1.1315 3.4690 3.2737 1.1522 6.2611 1.7705 5.4580 0.7402 2.7588 17.4842 6.5562 0.3597 2.7765 0.1057 33.9854 8.5571 2.9876 11.3613 19.6720 14.2052 11.8213 227.7640 20.8071 41.7265 1.2818 0.0042 1.7500 6.5153 28.2688 51.2934 41.4253 62.5404 57.3908 0.0620 26.2234 3.1210 0.8142 3.0445 12.4801 10.6145 0.0484 18.8966 26.5805 67.9242 2.0246 0.6346 24.1964 0.6559 0.1088 2.1390 0.0204 0.5121 5.2554 36.6954 18.1726 223.4491 29.5406 23.9003 11.1644 1.5988 5.3476 1.0888 1.3213 53.3612 2.9357 94.9873 13.0341 0.8760 34.6443 33.2908 8.7015 14.2473 13.4136 17.7455 273.0094 0.1892 3.5528 51.7974 6.5188 12.1292 2.2610 59.5857 12.4669 220.4388 2.3065 5.7691 0.8960 75.7618 365.9249 178.9968 248.3127 52.9427 28.1613 26.9655 3.1450 15.5625 3.7472 5.3763 5.5548 12.4602 1.6636 42.7317 6.2513 5.5011 15.1144 20.5041 35.7610 41.0819
temp: 298.150 k
press: 1.00000 atm
elementType: 8 8 8 8 8 7 7 6 6 6 6 6 6 6 6 6 6 6 6 6 6 6 6 6 6 6 1 1 1 1 1 1 1 1 1 1 1 1 1 1 1 1
symmnumber: 1
zpe: 829591.9 jmol-1
zpe.correction: 0.315975 hartree
zpe.thermalcorrener: 0.338915 hartree
zpe.thermalcorrenthalpy: 0.339859 hartree
zpe.thermalcorrgfe: 0.258795 hartree
zpe.sumelectzpe: -1217.462715 hartree
zpe.sumelectthermal: -1217.439776 hartree
zpe.sumelectthermalent: -1217.438831 hartree
zpe.sumelectthermalfe: -1217.519896 hartree
dipole: 1.8199 0.0086 3.1536
dipole: 3.6411
quadrupole: -121.7818 -142.9208 -153.8536
quadrupole: 17.6573 -11.2639 -13.5662
quadrupole: 17.7369 -3.4021 -14.3348 17.6573 -11.2639 -13.5662
hfenergy: -1217.7786902 hartree
pointgroup: C01 [X(C19H16N2O5)]
dipole: 0.6917604 -0.1133109 -1.2492806 debye
polarizability: 281.2112149|-35.3863622|241.7889894|13.5714651|-6.0699252|162.6913744 unknown
InChI: InChI=1S/C19H16N2O5/c22-16(20-15(19(25)26)10-12-6-2-1-3-7-12)11-21-17(23)13-8-4-5-9-14(13)18(21)24/h1-9,15,20,25H,10-11H2
charge 0 multiplicity 1
42 atoms
O  2.606435 3.050252 0.448678
O  1.212184 -0.888515 -1.71604
O  -0.495354 0.825207 1.116601
O  -4.174657 2.881796 -0.931752
O  -5.235172 2.159945 1.007932
N  1.617948 1.226974 -0.715885
N  -2.043537 1.341992 -0.554869
C  -3.230375 0.954176 0.210533
C  -3.885474 -0.384705 -0.304619
C  0.324434 1.832803 -0.98166
C  3.73178 0.840457 0.173065
C  3.315139 -0.343753 -0.484353
C  2.649592 1.866021 0.038818
C  1.950565 -0.114589 -1.056289
C  -0.764307 1.269863 -0.032906
C  -3.052341 -1.612633 0.023297
C  4.977677 0.924262 0.811186
C  4.132744 -1.482562 -0.525736
C  -4.301723 2.042727 0.19015
C  -1.929745 -1.974648 -0.763568
C  -3.378137 -2.408005 1.152125
C  5.811248 -0.223964 0.777097
C  5.395257 -1.408792 0.118586
C  -1.144183 -3.097937 -0.424402
C  -2.601079 -3.538593 1.488152
C  -1.478993 -3.885816 0.700547
H  -2.912168 0.804724 1.257564
H  -4.881366 -0.46607 0.16871
H  -4.039928 -0.286157 -1.396366
H  0.430195 2.917997 -0.794138
H  0.048376 1.672076 -2.039366
H  -2.19887 1.758444 -1.475568
H  5.286681 1.843757 1.317792
H  3.801602 -2.392521 -1.035633
H  -1.649829 -1.373753 -1.636023
H  -4.244809 -2.140191 1.769833
H  6.790047 -0.197727 1.267716
H  6.059431 -2.279611 0.110072
H  -0.266922 -3.339877 -1.033579
H  -2.86822 -4.144551 2.36142
H  -0.870793 -4.758868 0.96331
H  -4.912755 3.548963 -0.934033
