program: Gaussian 09
title: 000096928
version: EM64L-G09RevD.01
frameworkgroup: C1[X(C11H6ClN3O)]
method: RPBEPBE
basis: SDD
operation: Freq
keyword: #p
keyword: freq=noraman
keyword: PBEPBE/SDD
title: #p freq=noraman PBEPBE/SDD
converged: NO NO NO NO
title: Mulliken charges:
elementType: Cl O N N N C C C C C C C C C C C H H H H H H
charge: 0.015510 -0.192741 -0.345062 -0.045649 0.141773 0.121746 0.074240 0.220416 0.143230 -0.314289 -0.345654 -0.252977 -0.238688 -0.203625 -0.112138 -0.238767 0.274053 0.263550 0.284536 0.238144 0.237304 0.275088
chargesum: 0.00000
title: Mulliken charges with hydrogens summed into heavy atoms:
elementType: Cl O N N N C C C C C C C C C C C
charge: 0.015510 -0.192741 -0.345062 -0.045649 0.141773 0.121746 0.074240 0.220416 0.143230 -0.040236 -0.082104 0.031559 -0.000544 0.033679 0.162950 -0.238767
polarizability: 2.96882447e+02 2.25216957e+00 1.53496926e+02 2.37494227e-03 9.86329270e-04 5.56573019e+01
1716.lowfreq: -4.9581 -0.0016 0.0016 0.0021 4.1669 6.6200 44.9488 94.4955 140.6116
frequency: 44.9410 94.4954 140.6010 152.9887 165.4026 256.6030 265.7890 314.9243 345.4881 357.1390 399.3584 425.9740 462.2508 473.4742 517.8986 523.8009 586.2037 597.7764 617.3924 664.9595 682.2276 694.3626 714.2772 782.6702 790.5540 825.3461 827.0108 860.2157 897.3137 929.6178 980.9730 983.8708 1005.5901 1024.6449 1032.5362 1104.3146 1107.4814 1125.1729 1152.5917 1166.8424 1211.9092 1240.7773 1253.7899 1293.9031 1381.6275 1396.4943 1448.4110 1454.4541 1493.4051 1530.4610 1556.4870 1587.6008 1617.5217 1641.5006 3137.3458 3152.0209 3166.9551 3176.0585 3179.9268 3199.3156
redmass: 9.4902 4.5184 7.0311 11.2245 8.2600 5.0433 7.4112 10.4551 6.5411 9.7407 4.6219 6.7239 4.1291 9.9018 3.7073 10.0620 4.1244 7.4977 7.4674 7.1274 4.6621 8.5122 5.6169 2.4325 1.9015 1.5006 8.2118 6.8616 1.4835 7.8150 1.3112 1.3682 1.3379 2.2108 4.4202 2.0196 2.0697 4.5525 2.5985 1.1349 2.3151 3.3750 2.1581 1.8534 3.1849 4.4366 2.7050 2.9530 8.8233 9.0917 6.6682 6.7099 7.4088 11.2857 1.0865 1.0901 1.0956 1.0997 1.0892 1.1009
irintensity: 0.5229 6.1615 0.0093 0.4806 0.5782 0.2739 1.5323 6.5159 4.8348 1.2699 0.1304 2.7890 2.4485 9.2606 0.0692 3.3534 8.0929 9.6136 0.1170 18.4201 19.4456 31.5432 0.1242 46.2565 33.6544 45.0350 12.6909 2.9672 0.3249 30.7242 0.2693 3.3199 0.0505 18.8962 43.4078 10.6817 88.9653 40.9301 6.5559 1.4517 1.3465 6.0572 36.9676 46.3330 17.8155 34.7593 55.1749 76.6564 148.4402 125.2760 10.5774 23.2858 117.5141 196.1359 5.8379 6.3972 9.2103 22.2027 1.9502 0.2602
temp: 298.150 k
press: 1.00000 atm
elementType: 17 8 7 7 7 6 6 6 6 6 6 6 6 6 6 6 1 1 1 1 1 1
symmnumber: 1
zpe: 390072.6 jmol-1
zpe.correction: 0.148571 hartree
zpe.thermalcorrener: 0.160302 hartree
zpe.thermalcorrenthalpy: 0.161246 hartree
zpe.thermalcorrgfe: 0.110058 hartree
zpe.sumelectzpe: -1121.204479 hartree
zpe.sumelectthermal: -1121.192748 hartree
zpe.sumelectthermalent: -1121.191803 hartree
zpe.sumelectthermalfe: -1121.242992 hartree
dipole: -1.3840 4.3117 0.0000
dipole: 4.5284
quadrupole: -79.6416 -101.4214 -100.0514
quadrupole: 10.7164 0.0004 0.0008
quadrupole: 14.0632 -7.7166 -6.3466 10.7164 0.0004 0.0008
hfenergy: -1121.3530498 hartree
pointgroup: C01 [X(C11H6Cl1N3O1)]
dipole: 0.4501353 1.7237946 0.0000086 debye
dipolederiv: -0.9221267 -0.1750788 -0.0000097 -0.3898789 -0.1816229 -0.0000027 -0.0000038 -0.0000004 -0.0529463 -0.3806766 -0.1029562 0.0000056 -0.0140484 -1.1445762 0.0000465 0.000004 -0.0001004 -0.3200577 -0.2287818 0.5337235 -0.0000091 -0.7510468 -0.5880827 -0.000028 0.0000077 0.0000199 -0.0009646 -1.1217659 0.0971347 -0.000019 -0.1929383 -0.3857023 -0.0000029 -0.0000323 -0.0000127 -0.2493723 -0.7328502 -0.2493466 -0.0000018 0.5713207 -0.2539301 0.0000196 -0.0000399 -0.0000013 -0.064799 -0.2452317 -0.3510849 -0.0000048 -0.1566015 -0.2893825 0.0000002 0.0000058 0.0000002 -0.016144 0.8170247 -0.2545771 0.0000127 -0.0244386 0.1611041 -0.0000148 0.0000427 0.0000094 0.0727591 0.666173 0.0947774 0.0000179 0.9955719 0.3085332 0.0000149 -0.0000247 0.0000079 0.1382935 0.7626159 -0.0742886 0.0000022 -0.1219357 1.5407347 -0.000027 0.0000024 0.0000791 0.1987028 -0.1920212 0.2198825 -0.0000089 -0.1129618 0.0558262 -0.0000035 -0.000003 -0.0000085 -0.0928222 -0.4065623 0.1398971 -0.0000045 0.0711378 0.1341715 -0.0000036 -0.0000082 -0.0000095 -0.1545855 0.0991782 0.077069 0.0000015 -0.1293442 0.118958 -0.0000082 0.0000289 -0.0000025 -0.0978678 0.050234 -0.239682 -0.0000018 0.0117458 -0.1347741 0.000006 -0.0000051 0.0000082 -0.1610124 0.2332603 0.0317603 -0.0000003 0.0377629 0.1571954 -0.0000019 0.000004 0.0000004 -0.1245714 -0.3633123 -0.2393916 0.0000095 -0.0124215 -0.092275 -0.0000015 0.000005 -0.0000115 -0.0684922 1.8036909 0.4910259 0.0000163 0.1513397 0.4562542 -0.0000111 0.0000314 0.0000034 0.0288019 0.1054393 -0.0416666 0.0000011 0.0359447 -0.0031117 0.0000036 0.0000045 0.0000029 0.1556773 0.1020541 0.0220347 0.0000007 -0.0310289 -0.0465233 0.0000031 -0.0000063 0.000008 0.1623657 0.0848919 -0.0416727 -0.000001 0.0159622 0.0221709 0.0000047 -0.0000047 0.0000053 0.1580966 -0.0648716 0.0834223 0.0000009 0.0968691 0.0334291 -0.0000009 0.0000032 -0.0000038 0.1620462 -0.0952812 -0.0833574 0.0000008 -0.0919698 0.0581852 0.0000016 0.0000019 -0.0000009 0.1552643 0.0289194 0.0623753 -0.0000083 0.0409595 0.0734185 0.000006 -0.0000134 0.0000071 0.1716282 unknown
polarizability: 296.6944619|5.6560811|153.6849113|0.0024257|-0.0008539|55.6573019 unknown
InChI: InChI=1S/C11H6ClN3O/c12-9-5-6-10-13-8-4-2-1-3-7(8)11(16)15(10)14-9/h1-6H
charge 0 multiplicity 1
22 atoms
Cl -4.871134 -0.982064 -0.000076
O  0.013552 -2.517455 -0.000073
N  -0.949919 -0.348569 0.000019
N  0.42893 1.668239 -0.000005
N  -2.20018 -0.968828 -0.000009
C  1.486846 -0.582696 0.000039
C  1.566349 0.852844 0.000022
C  -0.764927 1.077311 -0.000024
C  0.186564 -1.27534 0.000092
C  2.676116 -1.359904 0.000009
C  2.847659 1.47654 -0.00001
C  -1.977376 1.868488 -0.000097
C  3.9300 -0.728838 -0.000008
C  4.012058 0.694169 -0.000019
C  -3.219174 1.269743 -0.000121
C  -3.249036 -0.173933 -0.000071
H  2.578987 -2.450387 0.000022
H  2.885219 2.569801 -0.000032
H  -1.841436 2.952496 -0.000132
H  4.846015 -1.328749 -0.000014
H  4.993695 1.180674 -0.000026
H  -4.150208 1.840258 -0.000185
