program: Gaussian 09
title: 000096920
version: EM64L-G09RevD.01
frameworkgroup: C1[X(C9H8N2O)]
method: RPBEPBE
basis: SDD
operation: Freq
keyword: #pfreq=noraman
keyword: PBEPBE/SDD
title: #p freq=noraman PBEPBE/SDD
converged: YES YES NO NO
title: Mulliken charges:
elementType: O N N C C C C C C C C C H H H H H H H H
charge: -0.204082 -0.678876 -0.006728 0.310062 -0.315057 -0.334718 0.504248 0.109997 -0.430184 -0.410124 -0.548056 -0.129633 0.235506 0.277112 0.223818 0.226433 0.268397 0.268442 0.317434 0.316010
chargesum: 0.00000
title: Mulliken charges with hydrogens summed into heavy atoms:
elementType: O N N C C C C C C C C C
charge: -0.204082 -0.045433 -0.006728 0.310062 -0.079551 -0.057606 0.504248 0.109997 -0.206367 -0.183691 -0.011217 -0.129633
polarizability: 2.03809753e+02 1.10182445e+01 1.03672644e+02 1.43500291e-02 -1.62223514e-02 4.93111691e+01
1716.lowfreq: -2.4556 -0.0010 -0.0005 -0.0002 7.8075 15.2816 38.9304 83.4021 101.0343
frequency: 38.8902 83.3883 101.0340 105.0946 194.7395 265.9246 288.5809 359.7207 367.7351 403.1415 409.2556 426.9234 445.5717 457.6394 493.4488 570.0966 605.4560 633.2133 738.7926 772.8053 814.4931 824.3675 840.4254 914.0750 921.3976 957.2974 993.4435 993.7566 1008.6951 1025.8577 1137.1269 1192.5594 1199.6611 1235.3568 1294.4468 1313.7516 1337.0094 1388.3767 1431.4572 1454.9080 1522.3820 1559.0422 1592.6334 1634.9076 1649.0579 2215.7664 2989.1972 3044.3189 3124.7363 3128.1054 3151.4836 3160.2156 3557.0192 3696.1472
redmass: 6.2321 3.5469 7.6310 4.6788 7.4089 4.4519 6.7034 3.0460 3.4088 11.0222 2.2845 1.1244 1.2367 4.9959 3.1922 2.5022 6.6955 6.8693 3.2323 5.7689 1.3851 5.4801 1.5881 7.3331 2.1208 1.5112 1.3762 3.3437 2.2571 1.5724 1.2261 1.1455 1.1052 2.0215 2.1637 1.3878 2.7291 4.1154 1.1210 4.5236 3.0599 6.8073 8.3201 3.1057 1.4629 12.4682 1.0590 1.0989 1.0876 1.0890 1.0952 1.0959 1.0453 1.1040
irintensity: 0.8743 10.2622 1.1404 4.6573 2.6730 2.3138 0.1638 2.1547 3.7852 2.2425 0.6772 0.9985 318.4491 1.0038 1.8429 13.3197 21.1634 0.8540 0.0112 3.3952 25.2287 0.1567 67.0712 59.4932 0.2018 0.4059 0.1850 1.8102 10.7257 4.9510 22.3290 145.9395 0.1843 122.8780 121.5382 6.6907 133.4557 13.2961 18.9902 15.0427 19.1854 114.9652 285.9690 70.2547 343.0050 13.4835 8.3859 1.4221 11.5500 19.0942 18.6210 5.3912 129.2500 26.3766
temp: 298.150 k
press: 1.00000 atm
elementType: 8 7 7 6 6 6 6 6 6 6 6 6 1 1 1 1 1 1 1 1
symmnumber: 1
zpe: 395156.0 jmol-1
zpe.correction: 0.150507 hartree
zpe.thermalcorrener: 0.161531 hartree
zpe.thermalcorrenthalpy: 0.162475 hartree
zpe.thermalcorrgfe: 0.113131 hartree
zpe.sumelectzpe: -531.628199 hartree
zpe.sumelectthermal: -531.617175 hartree
zpe.sumelectthermalent: -531.616231 hartree
zpe.sumelectthermalfe: -531.665575 hartree
dipole: -10.0354 -3.5956 0.0015
dipole: 10.6600
quadrupole: -76.2865 -64.2410 -72.2916
quadrupole: -6.0263 0.0322 -0.0105
quadrupole: -5.3468 6.6987 -1.3519 -6.0263 0.0322 -0.0105
hfenergy: -531.7787064 hartree
pointgroup: C01 [X(C9H8N2O1)]
dipole: 3.9371904 1.4450042 -0.0002265 debye
dipolederiv: -0.9762521 -0.1626408 0.0006007 -0.5791494 -0.8162052 0.0000636 -0.0006061 -0.0009464 -0.3020725 -1.8251233 -0.2103617 0.0009138 -0.2051371 -0.1290714 0.0018027 0.0008242 0.0017893 -0.7124983 -0.3590433 0.0522089 0.000431 -0.0184931 -0.1912163 0.0001848 -0.000095 0.0001504 -0.2333983 -1.3909974 -0.1232697 0.0013948 0.0548258 -0.3035549 -0.0004964 0.0016662 -0.0003593 -0.0703777 0.5439078 0.166233 -0.0004844 0.2804314 0.1810065 0.0003243 -0.000316 0.0004967 -0.1044362 0.5207594 -0.0110917 -0.0008926 -0.2453494 0.096609 0.0007447 -0.0012295 0.0004641 -0.0664537 1.8869195 0.2227484 -0.0018319 0.1795533 0.1220954 -0.0003771 -0.0020035 -0.0004304 0.167729 2.2000428 0.0871134 -0.0023875 0.052263 0.9491267 0.0009272 -0.0020565 0.0014536 0.129286 -0.7153902 -0.1003919 0.0004091 0.502776 0.0828389 0.0001257 0.0020424 0.000987 -0.231526 -0.5209389 -0.0995609 0.0001074 -0.5947599 -0.0434663 0.0013706 -0.0010854 0.0006394 -0.2300159 -0.2313942 0.1358813 0.0005496 0.3770952 -0.1589272 -0.0011862 0.0011351 -0.0009805 0.236411 0.2576581 0.0113453 -0.0002038 0.108603 -0.0654586 -0.0001923 0.00019 -0.0000947 -0.0432094 0.0352198 0.1080557 0.0004487 0.1190929 -0.0273263 -0.0005699 0.000479 -0.0005747 0.1378327 0.1195119 -0.0671259 -0.0001276 -0.0101454 0.0079659 -0.0003536 -0.0000205 -0.0002547 0.1469647 0.0045461 -0.0918384 -0.0000123 -0.0845455 -0.0776223 -0.0005338 0.000002 -0.000518 0.170234 -0.0518362 0.1085565 0.0005953 0.0911078 -0.0248778 -0.0006472 0.0005368 -0.000694 0.1686973 0.0056252 -0.0269155 -0.0350185 -0.0277708 0.0707127 -0.0531662 -0.0409926 -0.0695479 0.0314292 0.0056352 -0.0271278 0.0349702 -0.027851 0.0700543 0.0533594 0.040828 0.06978 0.0320652 0.2565615 0.0006049 0.0002213 -0.0650896 0.1177477 -0.0006292 0.0001268 -0.000725 0.3874345 0.2345884 0.0275769 0.0003166 0.092543 0.1395691 -0.0007508 0.0005746 -0.0006347 0.3859044 unknown
polarizability: 203.633783|11.7890432|103.848148|-0.1451719|0.1233481|49.3116358 unknown
InChI: InChI=1S/C9H8N2O/c10-6-5-9(12)7-1-3-8(11)4-2-7/h1-4H,5,11H2
charge 0 multiplicity 1
20 atoms
O  -1.802884 -1.589023 0.001105
N  4.366306 0.357374 -0.003231
N  -4.840681 0.241112 0.004281
C  0.147634 -0.169024 0.001611
C  0.723866 1.134521 0.004111
C  1.029949 -1.290106 -0.002585
C  2.989992 0.186204 -0.001666
C  -1.31394 -0.423749 0.003184
C  2.114218 1.315239 0.002573
C  2.418241 -1.125211 -0.004243
C  -2.245331 0.823423 0.006228
C  -3.674572 0.48733 0.005492
H  0.087306 2.026155 0.007354
H  0.5844 -2.29058 -0.004493
H  2.536689 2.327087 0.004632
H  3.07662 -2.0022 -0.007539
H  -2.022022 1.443595 0.896397
H  -2.022124 1.448251 -0.880652
H  4.991564 -0.444113 -0.006393
H  4.77897 1.286316 -0.001564
