program: Gaussian 09
title: 000096950
version: EM64L-G09RevD.01
frameworkgroup: C1[X(C16H16O3)]
method: RPBEPBE
basis: SDD
operation: Freq
keyword: #pfreq=noraman
keyword: PBEPBE/SDD
title: #p freq=noraman PBEPBE/SDD
converged: YES YES NO NO
title: Mulliken charges:
elementType: O O O C C C C C C C C C C C C C C C C H H H H H H H H H H H H H H H H
charge: -0.255749 -0.206812 -0.210121 0.247360 -0.601393 0.301200 0.328961 -0.156664 0.055899 -0.142673 -0.305128 -0.381628 -0.370703 0.391449 -0.225843 -0.233529 -0.790895 -0.811568 -0.492561 0.246201 0.231341 0.239468 0.292259 0.288485 0.240192 0.240062 0.219357 0.226326 0.215823 0.272698 0.217081 0.213209 0.250602 0.239475 0.227819
chargesum: 0.00000
title: Mulliken charges with hydrogens summed into heavy atoms:
elementType: O O O C C C C C C C C C C C C C C C C
charge: -0.255749 -0.206812 -0.210121 0.247360 -0.123851 0.301200 0.328961 -0.156664 0.055899 -0.142673 -0.065660 -0.089369 -0.082218 0.391449 0.014348 0.006533 -0.129389 -0.108579 0.225334
polarizability: 2.53740738e+02 -6.70997803e+00 2.36051639e+02 -1.49178297e+01 7.90888247e+00 1.11239027e+02
1716.lowfreq: -11.1319 -4.3574 -0.0006 -0.0005 -0.0004 1.3270 25.2452 30.1700 33.7542
frequency: 25.1830 30.1407 33.7070 59.7997 75.9592 105.3953 119.4785 128.2308 167.5699 177.6217 195.2197 205.3485 213.2677 252.6147 293.8831 311.7283 343.7997 352.2461 382.4711 392.1824 406.7765 421.2999 435.3394 436.5929 471.0241 491.4625 508.1311 575.9497 612.3694 653.3318 690.6171 702.6494 720.6600 765.2193 803.4362 812.0883 838.9817 856.4917 879.0636 927.7687 939.5324 947.9551 956.2201 991.3996 995.1222 1012.9138 1012.9208 1028.6758 1055.0511 1083.3014 1085.2003 1101.7577 1106.6100 1137.5436 1158.3769 1170.8847 1196.7681 1202.4224 1239.7093 1264.9624 1289.5093 1300.0117 1337.5080 1346.7269 1388.1621 1399.8147 1401.0026 1437.5669 1439.0095 1449.1520 1452.7265 1452.8830 1455.1801 1466.0648 1469.9313 1470.7607 1491.7669 1517.4276 1534.6540 1561.3814 1603.1067 1604.9637 1683.6571 2957.1757 2963.1331 3008.8609 3009.1931 3029.5366 3033.4451 3077.9137 3087.4646 3099.8625 3107.2566 3123.3922 3133.7604 3137.1268 3152.1076 3162.9901 3172.4510
redmass: 3.5437 3.7403 4.7735 3.1366 5.4739 4.3861 1.2524 3.1791 2.4706 1.9818 2.5321 1.8706 1.5864 2.9170 5.3346 4.6151 3.2289 4.7617 2.9616 4.9286 5.2292 3.7789 4.6384 3.0777 4.9195 4.6593 3.5592 4.4105 5.2648 6.0101 5.1467 5.3146 2.9045 2.5243 1.6758 4.4984 2.6320 1.9384 6.0177 1.6895 2.2863 5.4237 1.4022 1.2531 1.3940 2.3459 1.3744 2.4035 3.2468 1.7018 2.2447 1.2404 1.9616 1.4806 1.7949 1.1077 2.1046 3.0372 1.8142 1.6339 1.6184 3.3340 4.2108 1.4711 1.2672 1.2247 9.7484 1.4201 1.6989 1.1647 1.0720 1.0542 1.0647 1.0793 1.1733 2.1548 1.0682 8.3768 9.1034 7.9302 8.1750 6.6292 6.2261 1.0373 1.0392 1.0329 1.0575 1.0968 1.0956 1.0985 1.0942 1.0959 1.0936 1.1051 1.1064 1.0862 1.0903 1.0946 1.1002
irintensity: 0.1550 6.4960 3.3212 1.1228 0.3922 2.2388 0.6507 0.2904 3.0853 1.6890 0.3443 1.1358 0.5720 2.0112 0.1080 1.7024 0.1852 1.5053 2.5240 21.9482 4.2858 4.6512 4.1665 15.1446 2.9552 3.3151 0.4742 5.8845 17.0458 3.1454 3.2276 1.0438 53.1597 3.0539 40.2092 7.7666 5.9360 43.9271 11.7610 2.2745 7.7579 62.8972 0.7354 6.4910 3.8425 1.8247 0.0158 7.7425 38.8999 2.0369 10.5878 0.2882 30.1149 1.7532 11.3289 20.3704 8.0709 254.2906 58.2927 53.7951 11.4241 231.5374 112.0795 3.6519 20.3027 16.3972 0.6264 11.9017 2.4976 32.2150 46.9055 11.9376 3.0973 34.3579 9.4865 14.3865 12.2770 30.9642 300.8477 155.3794 18.2319 4.7686 16.9500 32.3194 73.4045 40.7459 30.4642 8.4797 45.1380 27.1853 7.1981 3.5547 22.5624 25.2491 24.6423 4.1863 5.9600 2.0407 26.6249
temp: 298.150 k
press: 1.00000 atm
elementType: 8 8 8 6 6 6 6 6 6 6 6 6 6 6 6 6 6 6 6 1 1 1 1 1 1 1 1 1 1 1 1 1 1 1 1
symmnumber: 1
zpe: 725960.2 jmol-1
zpe.correction: 0.276504 hartree
zpe.thermalcorrener: 0.295052 hartree
zpe.thermalcorrenthalpy: 0.295996 hartree
zpe.thermalcorrgfe: 0.228282 hartree
zpe.sumelectzpe: -843.575358 hartree
zpe.sumelectthermal: -843.556810 hartree
zpe.sumelectthermalent: -843.555865 hartree
zpe.sumelectthermalfe: -843.623580 hartree
dipole: -1.4364 1.0110 0.7601
dipole: 1.9139
quadrupole: -100.3681 -103.3565 -112.9447
quadrupole: 8.6485 0.3947 -4.6145
quadrupole: 5.1883 2.1999 -7.3882 8.6485 0.3947 -4.6145
hfenergy: -843.8518614 hartree
pointgroup: C01 [X(C16H16O3)]
dipole: -0.569343 -0.4029356 -0.2837088 debye
polarizability: 254.2604002|7.0684345|236.2255016|11.5748416|7.0733729|110.5455031 unknown
InChI: InChI=1S/C16H16O3/c1-10(2)8-9-13-14(17)11-6-4-5-7-12(11)15(18)16(13)19-3/h4-8H,9H2,1-3H3
charge 0 multiplicity 1
35 atoms
O  0.856592 -2.539066 0.537988
O  0.62239 2.159676 1.204344
O  -1.931645 -2.471614 -0.297304
C  0.74314 -0.215007 0.866462
C  2.206399 -0.222045 1.272186
C  -1.393668 1.116264 0.390602
C  -2.054414 -0.083155 0.010753
C  0.035837 1.083326 0.840814
C  0.08832 -1.386445 0.497255
C  -1.342767 -1.395004 0.04805
C  3.113767 -0.264806 0.043953
C  -2.088699 2.345715 0.344323
C  -3.405562 -0.042999 -0.411444
C  3.875559 0.754455 -0.449245
C  -3.435469 2.382685 -0.078214
C  -4.094755 1.186992 -0.456535
C  4.751978 0.536242 -1.67354
C  3.94038 2.151149 0.144763
C  0.314368 -3.909067 0.373009
H  2.40574 0.676282 1.877011
H  2.403491 -1.118633 1.888102
H  3.13076 -1.232843 -0.476681
H  -1.555011 3.253141 0.643326
H  -3.890356 -0.981387 -0.698317
H  -3.971456 3.337127 -0.113749
H  -5.139181 1.217287 -0.784373
H  4.449116 1.209113 -2.500742
H  4.701159 -0.504181 -2.039232
H  5.811443 0.771362 -1.44803
H  3.12979 2.349403 0.863407
H  4.913709 2.31763 0.649483
H  3.867946 2.910512 -0.658324
H  -0.05554 -4.066104 -0.651302
H  -0.502519 -4.102374 1.08659
H  1.182556 -4.551831 0.586013
