program: Gaussian 09
title: 000010775
version: EM64L-G09RevD.01
frameworkgroup: C1[X(C11H15NO4)]
method: RPBEPBE
basis: SDD
operation: Freq
keyword: #p
keyword: freq=noraman
keyword: PBEPBE/SDD
title: #p freq=noraman PBEPBE/SDD
converged: YES YES NO NO
title: Mulliken charges:
elementType: O O O O N C C C C C C C C C C C H H H H H H H H H H H H H H H
charge: -0.308616 -0.457020 -0.276550 -0.288176 -0.615486 -0.074969 -0.327867 -0.319600 0.249194 0.307430 -0.348942 -0.385012 -0.789286 -0.239665 -0.244364 0.292956 0.246234 0.227914 0.219893 0.250285 0.222342 0.245592 0.232200 0.219207 0.240959 0.227684 0.358455 0.225758 0.226822 0.341395 0.341231
chargesum: 0.00000
title: Mulliken charges with hydrogens summed into heavy atoms:
elementType: O O O O N C C C C C C C C C C C
charge: -0.308616 -0.098565 -0.276550 -0.288176 0.067140 0.171265 0.119941 0.153028 0.249194 0.307430 -0.103350 -0.152812 -0.101436 -0.013907 -0.017543 0.292956
polarizability: 1.89085989e+02 -1.13873376e+01 1.33877478e+02 -2.84465957e+00 -6.20551165e+00 9.32556638e+01
1716.lowfreq: 0.0003 0.0004 0.0005 3.4762 5.3453 10.6948 19.8087 28.3060 49.2086
frequency: 19.6911 28.2661 49.2051 54.9341 68.1613 92.1780 122.2993 147.6318 179.1859 206.3397 213.6346 243.0582 268.8046 319.6099 342.0405 422.4688 433.9178 442.6740 463.2236 472.4835 503.0492 523.1429 526.7115 540.4836 547.2997 604.1755 631.6738 705.1251 715.0289 752.0191 755.7822 788.8081 814.5005 844.5878 857.5302 926.4938 936.9550 971.7761 973.2394 982.6103 1019.7327 1045.5008 1047.5309 1051.9443 1062.3596 1081.3150 1104.9331 1116.9251 1172.4329 1190.4138 1206.9168 1229.3491 1237.4785 1272.8175 1286.0905 1299.8711 1315.8348 1352.7540 1370.9806 1386.7104 1399.4310 1408.6543 1430.0661 1431.3058 1458.8287 1459.5994 1477.1868 1489.5990 1588.2662 1598.0116 1609.8569 1685.9798 2965.0054 2978.2631 2988.2484 3025.1690 3039.4007 3054.7813 3091.2034 3120.2966 3123.4862 3135.7788 3156.1733 3170.0569 3534.6754 3557.9536 3716.2630
redmass: 5.3546 4.8635 5.7905 5.2392 5.1550 5.1218 1.1132 2.7030 3.5514 4.0487 5.7102 4.9435 4.0386 2.9728 2.8063 1.4916 2.3784 2.8308 2.6641 2.7931 1.1669 3.8764 1.1155 3.5158 3.8910 5.8654 4.8120 11.4326 2.5354 3.6665 1.5767 4.1166 4.8035 1.4689 2.8973 1.3907 1.6634 5.7414 1.3392 1.6383 5.3502 1.5522 2.1633 2.2548 2.2783 2.2783 3.0965 1.9141 1.1108 2.3297 1.1655 1.7483 1.5374 1.0816 1.4290 1.4005 2.4329 1.3112 1.5126 3.4476 1.3330 1.6007 1.8029 1.1832 1.1418 1.0477 1.2297 2.2485 1.2185 6.6559 6.4256 7.0228 1.0561 1.0373 1.0839 1.0615 1.1071 1.0964 1.0996 1.1032 1.0870 1.0890 1.0937 1.0991 1.0650 1.0447 1.1058
irintensity: 1.4403 0.0786 4.7248 3.2057 1.2943 5.9380 0.0694 5.7755 5.1655 3.8948 3.0783 8.7319 1.9813 9.4354 1.1874 124.7050 9.5881 1.7867 54.3119 37.5755 271.6668 11.8552 56.2792 0.5233 3.7089 6.7089 6.4086 38.2822 7.6302 22.2656 83.9028 11.6715 5.8646 3.4768 31.2059 3.5692 4.2067 120.2782 3.2433 8.8911 96.5787 10.8949 55.5685 11.7109 66.2944 1.5555 11.9626 71.6070 11.4421 86.4068 10.1673 157.9217 20.9446 2.2082 0.5803 47.2697 340.5154 4.6585 21.1820 9.0366 14.6454 5.2715 21.1974 34.4521 43.6753 14.9846 11.2696 74.8719 95.3760 15.6598 27.3342 377.2007 31.2711 28.9911 21.1749 28.7440 34.1685 22.0752 23.5581 6.7288 8.3482 12.0281 35.7515 12.9918 13.0314 75.1761 53.2410
temp: 298.150 k
press: 1.00000 atm
elementType: 8 8 8 8 7 6 6 6 6 6 6 6 6 6 6 6 1 1 1 1 1 1 1 1 1 1 1 1 1 1 1
symmnumber: 1
zpe: 652181.5 jmol-1
zpe.correction: 0.248403 hartree
zpe.thermalcorrener: 0.264980 hartree
zpe.thermalcorrenthalpy: 0.265924 hartree
zpe.thermalcorrgfe: 0.201901 hartree
zpe.sumelectzpe: -782.600602 hartree
zpe.sumelectthermal: -782.584025 hartree
zpe.sumelectthermalent: -782.583081 hartree
zpe.sumelectthermalfe: -782.647104 hartree
dipole: -0.8842 0.1480 -0.1426
dipole: 0.9077
quadrupole: -70.6484 -91.0849 -99.8987
quadrupole: -3.8393 3.6346 -8.7143
quadrupole: 16.5623 -3.8742 -12.6881 -3.8393 3.6346 -8.7143
hfenergy: -782.8490049 hartree
pointgroup: C01 [X(C11H15N1O4)]
dipole: -0.3494608 -0.0641852 0.0360122 debye
polarizability: 188.932027|10.2646301|134.6112707|7.3365158|1.2577172|92.6758327 unknown
InChI: InChI=1S/C11H15NO4/c1-8-4-2-3-5-10(8)15-6-9(13)7-16-11(12)14/h2-5,9,13H,6-7,12H2,1H3
charge 0 multiplicity 1
31 atoms
O  0.790522 -0.454008 -0.037921
O  -1.310289 -1.26913 -1.624385
O  -4.006982 0.005461 -0.687627
O  -3.80681 0.841797 1.512077
N  -5.650625 -0.440255 0.81501
C  -1.530817 -0.288405 -0.555821
C  -0.257887 0.540061 -0.322615
C  -2.693074 0.608851 -0.995484
C  2.111479 0.002499 0.161126
C  3.073141 -1.02132 0.403231
C  2.477344 1.368037 0.132229
C  4.413407 -0.624458 0.610374
C  2.652203 -2.476533 0.43141
C  3.827929 1.730574 0.343096
C  4.800233 0.737339 0.581877
C  -4.440785 0.191136 0.642052
H  -1.789344 -0.79852 0.394707
H  -0.385856 1.223802 0.539628
H  0.012984 1.117514 -1.23032
H  -2.68683 0.708694 -2.091439
H  -2.63312 1.596918 -0.50404
H  1.73186 2.148304 -0.046356
H  5.165975 -1.399818 0.797493
H  3.509945 -3.130481 0.662744
H  1.864126 -2.651068 1.186693
H  2.23091 -2.791741 -0.542103
H  -0.477285 -1.760866 -1.399527
H  4.11106 2.788688 0.321211
H  5.846634 1.014892 0.746228
H  -6.077338 -0.950762 0.045548
H  -6.102212 -0.3929 1.723603
