program: Gaussian 09
title: 000096894
version: EM64L-G09RevD.01
frameworkgroup: C1[X(C15H6N2O)]
method: RPBEPBE
basis: SDD
operation: Freq
keyword: #p
keyword: freq=noraman
keyword: PBEPBE/SDD
title: #p freq=noraman PBEPBE/SDD
converged: YES YES NO YES
title: Mulliken charges:
elementType: O N N C C C C C C C C C C C C C C C H H H H H H
charge: -0.122661 0.016208 -0.001860 -0.210993 0.312757 0.355165 0.499460 0.205909 -0.300493 -0.339118 -0.427587 -0.420599 -0.410769 -0.233755 -0.210634 0.154744 -0.168734 -0.234752 0.277059 0.283518 0.250562 0.249377 0.238121 0.239076
chargesum: 0.00000
title: Mulliken charges with hydrogens summed into heavy atoms:
elementType: O N N C C C C C C C C C C C C C C C
charge: -0.122661 0.016208 -0.001860 -0.210993 0.312757 0.355165 0.499460 0.205909 -0.300493 -0.062059 -0.144069 -0.170037 -0.161392 0.004366 0.028441 0.154744 -0.168734 -0.234752
polarizability: 2.94719921e+02 -2.43102901e+00 2.18650584e+02 -1.21467870e-02 7.91265701e-03 6.41990979e+01
1716.lowfreq: -7.1249 -1.3588 -1.2994 -0.0009 0.0003 0.0005 55.1018 58.3712 105.9420
frequency: 55.0980 58.3701 105.9416 130.1911 131.8421 173.9508 204.5661 229.5592 240.0532 281.7650 339.4047 394.6280 415.1552 421.0535 452.8108 453.7746 465.9474 500.9488 540.8144 570.3920 595.4855 597.6570 634.8713 670.2536 673.7572 764.4889 775.3462 789.3376 793.3853 837.3515 864.8803 869.8103 936.6657 951.4159 975.7039 996.5339 1003.1363 1024.3714 1028.2734 1065.7582 1116.4045 1180.0486 1185.4127 1199.4017 1236.3872 1244.3950 1283.7807 1364.8363 1397.8330 1424.3830 1454.8736 1462.1071 1493.3653 1564.0594 1604.3701 1611.0234 1627.2056 1638.0244 2161.1728 2174.6926 3135.9442 3136.8792 3154.5991 3158.9545 3170.8702 3179.8263
redmass: 7.5713 10.7829 9.9694 8.0476 12.8142 4.0962 6.7735 10.2314 4.5261 9.8687 7.4811 7.3424 6.4686 6.9229 10.0881 5.8582 3.3251 6.7254 7.3504 7.6315 12.2222 4.3310 3.5658 8.1686 8.0888 1.4403 9.0179 1.9481 5.3160 3.3134 2.7022 7.3434 1.4559 1.4744 7.4280 1.3801 1.3957 3.0813 3.8477 2.2165 2.7720 1.3444 3.0508 1.3929 1.8699 2.5491 2.9414 2.4437 4.7931 1.9208 3.1335 7.3667 3.6996 8.9304 7.7443 7.8891 9.8176 9.7198 12.6359 12.6419 1.0881 1.0880 1.0925 1.0939 1.0982 1.0962
irintensity: 0.0518 0.1637 1.2027 1.9305 4.1920 2.1571 9.0303 0.8698 5.0086 6.0427 0.0359 3.2085 0.5284 0.7053 1.8936 2.1711 1.6603 3.1512 8.4767 2.6992 0.3209 1.8052 0.0711 0.2404 0.0296 0.3529 26.6840 72.0748 0.0224 15.3388 47.3700 2.6919 0.0797 0.0172 2.0619 0.0021 2.1137 62.8009 52.2911 13.7711 2.3489 7.1880 12.3344 7.5651 6.7218 24.2515 61.0279 5.2967 3.4486 2.0821 2.1156 14.1960 15.7851 85.3517 66.1615 2.1556 54.4347 32.4330 7.0482 8.1201 0.9075 1.8328 10.1227 16.8915 17.1036 5.4031
temp: 298.150 k
press: 1.00000 atm
elementType: 8 7 7 6 6 6 6 6 6 6 6 6 6 6 6 6 6 6 1 1 1 1 1 1
symmnumber: 1
zpe: 426920.9 jmol-1
zpe.correction: 0.162606 hartree
zpe.thermalcorrener: 0.176129 hartree
zpe.thermalcorrenthalpy: 0.177073 hartree
zpe.thermalcorrgfe: 0.122082 hartree
zpe.sumelectzpe: -758.719611 hartree
zpe.sumelectthermal: -758.706088 hartree
zpe.sumelectthermalent: -758.705144 hartree
zpe.sumelectthermalfe: -758.760135 hartree
dipole: -8.7657 2.3256 0.0007
dipole: 9.0689
quadrupole: -108.2631 -105.8662 -103.5334
quadrupole: 4.4218 0.0005 0.0001
quadrupole: -2.3755 0.0214 2.3542 4.4218 0.0005 0.0001
hfenergy: -758.882217 hartree
pointgroup: C01 [X(C15H6N2O1)]
dipole: 3.45101 0.9061493 -0.0002588 debye
dipolederiv: -0.574897 -0.224724 0.000028 -0.0800459 -0.7985268 0.0000349 0.0000262 0.0000492 -0.263568 -0.2477036 0.0295811 0.0000067 0.0244196 -0.1093449 0.0000012 0.0000073 -0.0000029 -0.2156625 -0.2491344 -0.01293 -0.0000087 0.1631847 -0.1533524 0.0000134 -0.0000155 0.00001 -0.2215914 0.0133944 0.0084701 -0.0000032 -0.0827344 -0.006677 0.0000035 -0.0000004 -0.0000005 -0.0300887 -0.3899012 -0.0970568 0.0000244 -0.3341944 -0.1041733 0.000022 0.0000483 0.0000129 -0.0221028 -0.6917651 -0.1441781 0.0000479 -0.107126 -0.0853581 0.0000132 0.0000466 0.0000137 0.036156 -0.1383107 -0.068732 0.0000157 -0.0940931 -0.0175263 0.0000113 0.000021 0.0000103 0.0909006 0.5188843 0.254202 -0.0000392 0.834303 -0.2153782 -0.0000286 -0.0000798 0.0000001 0.066274 1.4769522 0.2544559 -0.0000839 -0.2951469 0.9737714 -0.0000336 -0.0000591 -0.0000655 0.1276114 0.2003538 -0.0714774 -0.00001 0.2816052 -0.0691485 -0.0000173 -0.0000349 -0.0000021 -0.0966947 0.1010337 0.2113781 -0.0000242 -0.0276921 0.1148816 -0.0000127 -0.0000121 -0.0000232 -0.1144246 0.1518837 0.1085419 -0.0000241 -0.1477204 0.083479 -0.0000058 -0.0000115 -0.0000201 -0.1488445 0.1930719 -0.0229298 -0.0000182 0.0824393 0.0898941 -0.0000202 -0.0000259 -0.0000163 -0.1482139 -0.4321013 0.0841165 0.0000101 0.1655017 0.165083 -0.0000267 0.0000088 -0.0000196 -0.1411687 0.0591574 -0.1991481 0. -0.1841575 -0.1574009 0.0000117 -0.0000021 0.0000139 -0.1446028 -0.127153 -0.0835587 0.0000233 0.1871519 0.2506412 -0.0000146 0.0000043 0.0000066 0.1745897 0.0449413 0.0228834 -0.0000058 -0.0327391 -0.0448055 -0.0000017 -0.0000166 -0.0000009 0.0604 0.0530496 -0.0486682 0.0000105 -0.3411039 -0.0008114 -0.0000015 0.0000425 -0.0000149 0.0507201 0.036328 0.0661531 0.0000013 0.0442501 0.0674267 0.0000025 0.0000014 0.0000022 0.1504192 0.0973109 -0.0338266 0.0000056 0.0029475 -0.0195292 0.0000106 0.0000036 0.0000098 0.1600439 -0.0543451 -0.0905167 0.0000174 -0.0377408 0.0546849 0.0000081 0.0000148 0.0000111 0.1555147 -0.0681173 -0.0269433 0.0000146 -0.0857875 0.062986 0.0000104 0.0000188 0.0000079 0.1544069 0.0746745 -0.0067989 0.0000052 -0.0436097 -0.0974755 0.0000172 0.0000073 0.0000147 0.1586944 -0.047607 0.0917065 0.0000065 0.1080889 0.0166602 0.0000024 0.0000067 0.0000035 0.1612315 unknown
polarizability: 294.7318405|2.2367545|218.6386647|-0.012167|-0.0078816|64.1990979 unknown
InChI: InChI=1S/C15H6N2O/c16-7-10(8-17)14-11-5-1-3-9-4-2-6-12(13(9)11)15(14)18/h1-6H
charge 0 multiplicity 1
24 atoms
O  -1.094572 -2.624212 0.000113
N  -4.301445 -1.72753 0.000149
N  -3.355713 2.56164 0.00001
C  1.287315 0.039739 -0.000182
C  0.078797 0.820339 -0.000156
C  1.039706 -1.362663 -0.000078
C  2.594958 0.597889 -0.000283
C  -1.041137 -0.130414 -0.000038
C  -0.439281 -1.550884 0.000006
C  0.191681 2.220162 -0.000244
C  2.110073 -2.26043 -0.000079
C  2.675888 2.031608 -0.000372
C  3.68508 -0.337797 -0.000285
C  1.501013 2.80354 -0.000352
C  3.439337 -1.723181 -0.000189
C  -2.407073 0.102723 0.000007
C  -3.401295 -0.939781 0.000102
C  -2.933039 1.442281 -0.000038
H  -0.685225 2.87285 -0.000242
H  1.942779 -3.341883 -0.000007
H  3.654767 2.524454 -0.000458
H  4.716817 0.032218 -0.000368
H  1.581006 3.895594 -0.000419
H  4.288063 -2.415163 -0.000199
