program: Gaussian 09
title: 000096904
version: EM64L-G09RevD.01
frameworkgroup: C1[X(C18H16O2)]
method: RPBEPBE
basis: SDD
operation: Freq
keyword: #pfreq=noraman
keyword: PBEPBE/SDD
title: #p freq=noraman PBEPBE/SDD
converged: YES YES NO NO
title: Mulliken charges:
elementType: O O C C C C C C C C C C C C C C C C C C H H H H H H H H H H H H H H H H
charge: -0.418030 -0.228002 0.216018 0.548622 -0.568795 0.433549 0.186755 -0.607356 -0.382431 0.420750 -0.422066 -0.458296 -0.475970 -0.472284 -0.480633 -0.369568 -0.434482 -0.264476 -0.247437 0.172708 0.208591 0.203692 0.227096 0.233490 0.236936 0.234784 0.237502 0.236795 0.249700 0.253740 0.234592 0.222883 0.239229 0.226927 0.228686 0.376780
chargesum: 0.00000
title: Mulliken charges with hydrogens summed into heavy atoms:
elementType: O O C C C C C C C C C C C C C C C C C C
charge: -0.041250 -0.228002 0.216018 0.548622 -0.156512 0.433549 0.186755 -0.380260 0.087995 0.420750 -0.187282 -0.220793 -0.239176 0.031155 -0.246041 -0.146685 -0.195252 -0.037549 -0.018751 0.172708
polarizability: 3.04457247e+02 -2.96999032e+01 2.19448863e+02 3.12399481e+01 1.28376564e+01 1.13053231e+02
1716.lowfreq: -6.4286 -4.1008 -0.0006 0.0004 0.0006 3.8797 12.5591 19.0061 36.8103
frequency: 12.4975 19.0015 36.7783 76.1586 79.8359 89.4438 106.4976 153.1517 183.1524 202.7765 242.9770 251.7985 324.2535 340.2488 401.5368 415.0360 429.3322 442.0366 463.2282 488.7198 505.6295 520.1753 538.1288 566.9969 584.6772 623.3625 636.3921 642.9925 698.5439 709.8825 730.5760 742.1004 756.4378 767.1123 803.8285 814.8559 843.8425 858.7319 860.3238 870.7185 886.0252 894.2166 907.4650 954.4922 966.3133 983.2899 991.2883 1008.8192 1018.5124 1039.6599 1051.7049 1061.3650 1083.7234 1096.4418 1135.8092 1153.8316 1165.1943 1176.9043 1201.4456 1230.8323 1232.3409 1233.8768 1252.0530 1255.6611 1274.0818 1281.4926 1287.9798 1313.4909 1335.3427 1369.0127 1390.1615 1400.3720 1408.1196 1431.9365 1438.3194 1447.6238 1452.3100 1467.6919 1483.2154 1513.1028 1522.7534 1574.1807 1611.4243 1627.7330 1630.3137 1669.9099 2966.5474 2983.9899 3007.2118 3019.9130 3035.3029 3072.4696 3114.2219 3117.8469 3120.7230 3129.3092 3134.8594 3139.1909 3143.5663 3149.6335 3164.3733 3511.0304
redmass: 9.5580 6.4722 5.4523 2.1226 3.2431 3.2388 3.9764 4.8996 3.8029 4.4315 4.1179 5.1251 3.5910 3.7440 5.9686 3.2962 3.0020 4.6906 3.8153 3.6284 2.0329 3.9509 3.9474 3.3281 4.4463 6.9339 3.3194 1.3579 5.0299 5.8428 2.3890 1.1833 1.4146 4.1757 2.0113 1.4558 1.5796 2.9862 2.0939 3.7876 1.6773 3.5655 2.1363 1.3673 1.3723 1.3831 1.3836 3.4707 3.3885 2.1088 2.7297 2.0668 2.4785 2.1899 1.2628 1.2980 1.2388 1.0861 2.0018 1.6737 1.5653 2.1985 1.3844 1.3888 1.4829 1.4377 1.2492 2.0815 1.5762 1.8364 3.8922 3.9153 2.5263 3.0726 1.0850 3.3777 2.6432 1.0971 1.1016 3.6230 3.8174 7.6040 5.8449 6.7058 6.6936 8.2879 1.0604 1.0622 1.0602 1.0994 1.0978 1.1036 1.0866 1.0861 1.0861 1.0896 1.0902 1.0973 1.0980 1.0931 1.0997 1.0639
irintensity: 0.9222 0.2329 0.3289 0.3159 0.3549 0.1797 1.2031 0.5940 0.2671 1.4168 0.6701 4.5414 0.3424 1.7305 6.0520 3.6682 8.7668 17.9833 2.6117 2.8566 29.5094 6.2685 1.7263 14.6060 13.7489 4.9252 12.0500 128.6302 5.2019 0.2984 0.2389 12.0318 56.6866 1.1690 0.0112 6.8613 6.2711 34.4723 43.7762 4.6495 11.7375 1.5013 6.7472 2.4485 4.1299 0.4293 0.0893 117.3277 100.5827 8.0585 52.1711 9.9897 60.8680 9.6710 2.4249 5.0789 2.9765 0.3996 2.5237 3.2478 12.3731 0.6234 5.3482 11.2485 31.8730 2.1989 0.5027 1.2953 34.1622 43.2877 1.9239 1.2865 0.1482 5.5753 25.4113 0.8981 12.2990 0.4451 17.8808 14.2115 5.7214 0.6575 8.0957 0.5768 10.9240 197.8213 37.1479 13.7955 23.1537 11.2065 0.3807 32.6839 8.8877 1.1143 2.8017 15.1079 5.0348 16.4224 38.7163 41.6157 32.7516 19.9731
temp: 298.150 k
press: 1.00000 atm
elementType: 8 8 6 6 6 6 6 6 6 6 6 6 6 6 6 6 6 6 6 6 1 1 1 1 1 1 1 1 1 1 1 1 1 1 1 1
symmnumber: 1
zpe: 756971.7 jmol-1
zpe.correction: 0.288315 hartree
zpe.thermalcorrener: 0.305287 hartree
zpe.thermalcorrenthalpy: 0.306231 hartree
zpe.thermalcorrgfe: 0.240319 hartree
zpe.sumelectzpe: -844.606616 hartree
zpe.sumelectthermal: -844.589644 hartree
zpe.sumelectthermalent: -844.588700 hartree
zpe.sumelectthermalfe: -844.654612 hartree
dipole: -0.4040 -0.5720 -1.3828
dipole: 1.5500
quadrupole: -100.2029 -104.4108 -125.8365
quadrupole: 2.3452 9.0439 0.1594
quadrupole: 9.9471 5.7393 -15.6864 2.3452 9.0439 0.1594
hfenergy: -844.8949314 hartree
pointgroup: C01 [X(C18H16O2)]
dipole: 0.1636359 -0.1411866 0.5702384 debye
polarizability: 303.646945|35.1619976|214.5554955|26.190061|-27.344101|118.7569002 unknown
InChI: InChI=1S/C18H16O2/c19-18(20)7-3-4-13-8-9-15-11-10-14-5-1-2-6-16(14)17(15)12-13/h1-2,5-6,8-12,19H,3-4,7H2
charge 0 multiplicity 1
36 atoms
O  7.025816 -1.168633 -0.033688
O  5.749742 -0.212326 -1.720912
C  -1.296499 0.330438 0.203024
C  1.090027 0.772091 0.72797
C  2.447426 0.287321 1.215907
C  -1.433808 1.690331 -0.256943
C  -2.462684 -0.557734 0.156379
C  -0.019679 -0.088686 0.688802
C  3.456833 0.077324 0.055141
C  -3.715176 -0.048545 -0.350777
C  0.931935 2.117664 0.26998
C  -0.302499 2.562504 -0.209718
C  -2.706929 2.15918 -0.756086
C  4.82372 -0.408251 0.57354
C  -3.804824 1.322435 -0.802221
C  -2.420975 -1.918176 0.592766
C  -4.859369 -0.904201 -0.402434
C  -3.554602 -2.740621 0.534259
C  -4.787208 -2.232424 0.032328
C  5.856205 -0.562602 -0.525962
H  2.329132 -0.663887 1.770914
H  2.875294 1.021452 1.92933
H  0.114299 -1.115633 1.046037
H  3.046336 -0.654172 -0.665511
H  3.586863 1.019723 -0.507907
H  1.788206 2.802481 0.302962
H  -0.420394 3.596129 -0.556675
H  -2.781645 3.197844 -1.099354
H  5.236053 0.301041 1.319875
H  4.735805 -1.376775 1.102194
H  -4.767419 1.683916 -1.182946
H  -1.489114 -2.338467 0.983332
H  -5.801753 -0.499597 -0.790991
H  -3.492706 -3.779725 0.875903
H  -5.669945 -2.879551 -0.011496
H  7.689437 -1.242967 -0.772622
