program: Gaussian 09
title: 000096891
version: EM64L-G09RevD.01
frameworkgroup: C1[X(C14H13NO2)]
method: RPBEPBE
basis: SDD
operation: Freq
keyword: #p
keyword: freq=noraman
keyword: PBEPBE/SDD
title: #p freq=noraman PBEPBE/SDD
converged: YES YES NO NO
title: Mulliken charges:
elementType: O O N C C C C C C C C C C C C C C H H H H H H H H H H H H H
charge: -0.413659 -0.235137 -0.004277 -0.418447 -0.496317 -0.410901 0.197818 -0.470954 -0.098571 0.137820 0.273703 -0.113887 -0.359136 0.043870 -0.318779 -0.257167 -0.232493 0.205965 0.211614 0.226665 0.249799 0.208485 0.214768 0.246853 0.232298 0.269327 0.265500 0.229788 0.233106 0.382346
chargesum: 0.00000
title: Mulliken charges with hydrogens summed into heavy atoms:
elementType: O O N C C C C C C C C C C C C C C
charge: -0.031313 -0.235137 -0.004277 -0.000868 -0.019853 0.012352 0.197818 0.008197 -0.098571 0.137820 0.273703 -0.113887 -0.089809 0.043870 -0.053279 -0.027379 0.000613
polarizability: 2.40050409e+02 4.59683860e+00 1.76555616e+02 2.62642261e+00 -1.42719370e+00 8.52680619e+01
1716.lowfreq: -15.9005 -10.7025 -0.0010 -0.0006 -0.0005 5.2746 52.5919 57.6723 82.1126
frequency: 52.2767 57.4498 82.0769 93.5158 145.1420 183.1215 223.2814 241.3638 303.1559 305.7297 339.5428 369.0724 378.8028 417.7548 445.4398 469.8603 498.3979 521.3771 543.7422 592.5209 603.3100 620.9594 654.5483 672.7554 680.9320 725.4628 777.1093 790.4402 814.2204 827.2168 832.5262 883.2338 889.2622 896.8705 915.3673 957.8489 969.1027 988.1045 996.8325 1027.8417 1067.2662 1082.8245 1095.6215 1114.3101 1134.0641 1153.2042 1167.2607 1184.2642 1237.5865 1247.3642 1254.3324 1266.7029 1290.0088 1309.8708 1322.2979 1338.4739 1339.3177 1347.9637 1363.0472 1384.4713 1415.8775 1445.8537 1446.9097 1452.0622 1472.3185 1477.0592 1488.0936 1545.8123 1559.3377 1618.5901 1632.6695 2973.1037 2979.1134 2982.7799 2987.6083 3038.6138 3044.8115 3049.3305 3056.9939 3133.2441 3149.8748 3169.3028 3179.0158 3497.8598
redmass: 4.7177 5.0699 3.3160 3.5205 3.1299 6.2068 4.9570 4.6173 2.3018 2.7053 6.6267 5.3280 4.0061 4.0215 3.7470 3.1711 3.4672 2.5322 3.8996 4.3802 3.5173 1.6803 5.0569 3.4904 3.4704 4.2893 1.4781 2.5002 4.6961 4.3384 2.0631 1.6990 2.2884 1.6498 4.8521 3.1459 1.3820 2.7733 1.3291 2.1671 2.6022 1.9569 1.6125 2.0523 1.1685 1.5825 1.5958 1.3700 1.9616 1.4306 2.0801 1.2964 1.5542 4.0640 1.5891 1.8758 1.5982 1.7037 3.5348 2.6457 4.4160 1.1252 2.5022 1.2541 1.0940 1.0956 3.0238 9.2104 7.7632 6.1363 8.7720 1.0679 1.0649 1.0605 1.0632 1.0963 1.0973 1.0981 1.0994 1.0863 1.0907 1.0965 1.0970 1.0638
irintensity: 1.9113 0.2190 0.6673 0.0119 5.0451 0.5184 2.8184 0.3350 0.9406 1.1716 1.8395 0.2748 1.0417 0.4046 6.5799 0.6075 5.0231 7.1939 0.6383 52.8918 25.2486 99.3030 6.5518 4.7964 9.5234 5.4047 82.8029 8.5189 0.3682 6.1023 8.7237 2.0939 5.0990 4.7611 33.3843 11.0829 1.4341 27.8359 0.2798 6.0843 236.6274 9.2649 3.6841 1.7916 0.9623 21.9609 3.3781 8.2330 4.8814 3.6481 19.6206 3.8378 10.0316 29.4702 4.2166 4.6316 5.2236 6.5473 18.6490 19.4046 6.4922 35.6248 0.5721 1.4623 12.0485 12.4765 52.0245 27.5344 9.4667 2.8147 201.0636 11.8954 36.9350 40.5420 10.6832 38.2228 66.9716 18.7269 43.1540 5.3746 14.4799 14.6045 16.7070 33.9847
temp: 298.150 k
press: 1.00000 atm
elementType: 8 8 7 6 6 6 6 6 6 6 6 6 6 6 6 6 6 1 1 1 1 1 1 1 1 1 1 1 1 1
symmnumber: 1
zpe: 623757.2 jmol-1
zpe.correction: 0.237577 hartree
zpe.thermalcorrener: 0.251263 hartree
zpe.thermalcorrenthalpy: 0.252207 hartree
zpe.thermalcorrgfe: 0.196930 hartree
zpe.sumelectzpe: -745.310429 hartree
zpe.sumelectthermal: -745.296743 hartree
zpe.sumelectthermalent: -745.295799 hartree
zpe.sumelectthermalfe: -745.351075 hartree
dipole: 1.7061 0.9478 0.8559
dipole: 2.1311
quadrupole: -84.2452 -94.9962 -103.0734
quadrupole: 4.4197 -2.4851 4.7358
quadrupole: 9.8597 -0.8913 -8.9684 4.4197 -2.4851 4.7358
hfenergy: -745.5480057 hartree
pointgroup: C01 [X(C14H13N1O2)]
dipole: -0.6643461 0.3554978 -0.3677663 debye
polarizability: 239.8332774|-3.7898853|176.4698598|7.4313147|-1.3570913|85.5709496 unknown
InChI: InChI=1S/C14H13NO2/c16-14(17)13-9-5-1-3-7-11(9)15-12-8-4-2-6-10(12)13/h1,3,5,7,16H,2,4,6,8H2
charge 0 multiplicity 1
30 atoms
O  -0.76541 2.963709 -1.008852
O  0.833857 3.136959 0.650196
N  0.01427 -1.939517 0.008981
C  -3.722364 0.037693 0.352264
C  -2.534785 0.924894 -0.079749
C  -3.677398 -1.314835 -0.386518
C  -1.183723 0.211814 -0.041627
C  -2.404747 -2.080953 0.021989
C  -1.1369 -1.236844 -0.011952
C  0.046144 0.906219 -0.029151
C  1.299434 0.184205 0.029602
C  1.22052 -1.261971 0.02826
C  2.59786 0.794602 0.058113
C  0.09735 2.403776 -0.052123
C  2.419535 -2.044138 0.047095
C  3.751579 0.006541 0.075782
C  3.667806 -1.421745 0.069692
H  -3.689873 -0.140856 1.446007
H  -4.6670 0.573082 0.140712
H  -2.498266 1.837786 0.542265
H  -2.705953 1.282486 -1.11369
H  -3.683303 -1.137406 -1.480661
H  -4.571058 -1.922825 -0.15294
H  -2.236581 -2.970039 -0.61123
H  -2.52299 -2.464214 1.056611
H  2.683487 1.88352 0.088152
H  2.308572 -3.132616 0.043307
H  4.734925 0.488984 0.099946
H  4.584819 -2.020738 0.084261
H  -0.669508 3.955427 -0.975642
