program: Gaussian 09
title: 000096865
version: EM64L-G09RevD.01
frameworkgroup: C1[X(C16H13NO)]
method: RPBEPBE
basis: SDD
operation: Freq
keyword: #p
keyword: freq=noraman
keyword: PBEPBE/SDD
title: #p freq=noraman PBEPBE/SDD
converged: NO YES NO NO
title: Mulliken charges:
elementType: O N C C C C C C C C C C C C C C C C H H H H H H H H H H H H H
charge: -0.255325 -0.447131 0.454848 0.411224 0.399177 0.398780 -0.667394 -0.657672 -0.688274 -0.434094 0.515693 -0.373363 -0.424703 -0.420721 -0.242377 -0.243972 0.211885 -0.801544 0.241668 0.248631 0.230218 0.242318 0.311596 0.239200 0.240704 0.227313 0.227961 0.311306 0.238447 0.269880 0.235717
chargesum: 0.00000
title: Mulliken charges with hydrogens summed into heavy atoms:
elementType: O N C C C C C C C C C C C C C C C C
charge: -0.255325 -0.135824 0.454848 0.411224 0.399177 0.398780 -0.425726 -0.409040 -0.458055 -0.191776 0.515693 -0.061767 -0.185503 -0.180017 -0.015064 -0.016011 0.211885 -0.057500
polarizability: 3.97818269e+02 1.17127859e+01 1.82551504e+02 3.03630641e-02 -5.64692875e-03 7.50010721e+01
1716.lowfreq: -76.2716 -9.0385 -5.5590 -0.0007 -0.0004 0.0003 4.7587 40.3024 58.2174
frequency: -76.2666 40.2931 58.1937 105.2377 109.8276 122.8364 206.3185 211.5017 254.5620 257.5421 326.8877 339.8373 400.1785 408.2311 431.2336 471.1387 473.8432 501.5284 540.2847 563.8127 576.5446 614.4617 628.6926 629.9571 668.2404 686.9566 747.4463 752.8983 757.3391 782.1818 791.4988 822.2017 837.1126 848.6669 872.1114 900.6932 913.2004 914.5898 935.9218 963.5997 967.7329 988.9821 994.6535 1003.1092 1014.0032 1030.3874 1113.1740 1155.3272 1171.2804 1187.0032 1194.7552 1205.4253 1245.0411 1275.3200 1283.6918 1292.9572 1316.0342 1347.5900 1376.2211 1396.3544 1418.5457 1429.4333 1440.8647 1449.8494 1459.1270 1468.6658 1485.0907 1509.5335 1556.4300 1567.1181 1591.7779 1635.4592 1636.5251 1641.8760 2987.4799 3072.6155 3102.2907 3113.4899 3117.7355 3118.3218 3123.5748 3130.2868 3136.1786 3141.8488 3161.1865 3194.6132 3518.3515
redmass: 1.0525 6.4470 4.3901 4.7172 4.8467 3.7351 4.7124 6.3008 5.1202 4.0729 4.3474 4.0330 3.3646 4.7536 5.6100 2.5034 2.5892 4.9322 3.4227 5.5824 3.0960 6.6036 2.0875 6.8757 1.4870 5.6442 5.7552 1.4727 2.2375 4.8986 2.0974 3.7206 1.2950 1.4766 1.6526 5.5599 1.5492 5.7067 2.1451 2.8650 1.4038 1.3452 1.8287 1.3253 2.3244 1.6565 1.9796 1.3488 1.0865 1.3623 1.4795 2.0799 1.7210 2.0575 1.5504 2.7360 2.7218 2.0467 1.2341 3.2824 3.0741 4.2323 4.6460 1.2836 2.2926 1.0472 3.1019 2.3641 4.7246 6.3196 5.1831 5.5253 6.6130 6.0618 1.0383 1.0984 1.0911 1.0908 1.0912 1.0862 1.0885 1.0907 1.0979 1.0950 1.1003 1.0950 1.0762
irintensity: 0.0267 0.9105 10.1166 0.9660 4.8815 0.5936 0.0046 6.4904 0.1094 0.0008 0.9522 0.6601 1.3721 2.3786 5.4109 15.5792 13.0084 5.8343 4.1229 2.2110 0.5411 7.3899 41.2295 0.6659 29.3196 2.9408 0.6749 66.6326 12.2947 0.0354 0.1223 0.2791 4.7728 3.7952 0.1507 0.5254 123.9857 6.4834 0.5097 27.3102 16.6201 0.0000 19.5988 0.3222 5.1698 8.4481 1.1656 16.9882 0.6196 5.0691 2.2861 36.0493 109.4959 5.2589 6.8749 8.1229 114.6409 140.1356 55.3809 29.2379 165.2511 0.9663 21.3544 17.1208 25.0369 20.1001 287.0270 101.7774 5.7554 21.6508 78.4823 232.2549 12.8927 74.7350 9.1300 15.5326 22.1787 16.7635 0.1492 9.4414 0.2434 13.0299 8.5404 35.7924 48.8342 14.2385 8.7096
temp: 298.150 k
press: 1.00000 atm
elementType: 8 7 6 6 6 6 6 6 6 6 6 6 6 6 6 6 6 6 1 1 1 1 1 1 1 1 1 1 1 1 1
symmnumber: 1
zpe: 641407.2 jmol-1
zpe.correction: 0.244299 hartree
zpe.thermalcorrener: 0.258031 hartree
zpe.thermalcorrenthalpy: 0.258975 hartree
zpe.thermalcorrgfe: 0.203378 hartree
zpe.sumelectzpe: -746.285530 hartree
zpe.sumelectthermal: -746.271798 hartree
zpe.sumelectthermalent: -746.270854 hartree
zpe.sumelectthermalfe: -746.326452 hartree
dipole: -0.3797 -3.5811 0.0116
dipole: 3.6012
quadrupole: -95.7280 -91.2988 -111.5770
quadrupole: -18.9509 0.0600 0.0071
quadrupole: 3.8066 8.2358 -12.0424 -18.9509 0.0600 0.0071
hfenergy: -746.5298293 hartree
pointgroup: C01 [X(C16H13N1O1)]
dipole: -0.1679867 1.4068296 -0.0043751 debye
polarizability: 398.0902456|-8.8638261|182.2795253|0.0384127|0.0086759|75.0010743 unknown
InChI: InChI=1S/C16H13NO/c1-11(18)17-16-7-6-14-8-12-4-2-3-5-13(12)9-15(14)10-16/h2-10,17H,1H3
charge 0 multiplicity 1
31 atoms
O  5.105577 -1.039117 0.00401
N  3.640755 0.804478 0.002986
C  -0.09984 0.488245 0.001341
C  -0.269307 -0.962756 0.00034
C  -2.559097 0.767241 0.000505
C  -2.72648 -0.684698 -0.000497
C  -1.252401 1.314407 0.001388
C  -1.574225 -1.509791 -0.000544
C  1.229997 1.027796 0.002226
C  0.912806 -1.785289 0.000329
C  2.354134 0.194366 0.002153
C  2.189922 -1.242167 0.001214
C  -3.738134 1.597447 0.000568
C  -4.060437 -1.229847 -0.001399
C  -5.010394 1.034026 -0.000327
C  -5.174372 -0.395914 -0.001326
C  4.909303 0.210241 0.002871
C  6.05429 1.22558 -0.001714
H  -1.131578 2.405448 0.002133
H  -1.696409 -2.600487 -0.00127
H  1.351052 2.119913 0.002949
H  0.792899 -2.875262 -0.000367
H  3.081782 -1.87066 0.001395
H  -3.614296 2.687254 0.001326
H  -4.182786 -2.31977 -0.002147
H  -5.897696 1.676863 -0.000279
H  -6.183613 -0.822048 -0.002019
H  3.632365 1.827757 0.003034
H  6.03392 1.848063 -0.915702
H  7.00674 0.677644 0.02968
H  6.001921 1.898139 0.874644
