program: Gaussian 09
title: 000096908
version: EM64L-G09RevD.01
frameworkgroup: C1[X(C12H22N3PS)]
method: RPBEPBE
basis: SDD
operation: Freq
keyword: #p
keyword: freq=noraman
keyword: PBEPBE/SDD
title: #p freq=noraman PBEPBE/SDD
converged: YES YES NO NO
title: Mulliken charges:
elementType: S P N N N C C C C C C C C C C C C H H H H H H H H H H H H H H H H H H H H H H
charge: -0.299217 0.675434 -0.397265 -0.380550 -0.448631 -0.002059 -0.019972 -0.458286 -0.441791 -0.703151 -0.704637 -0.382602 -0.430800 -0.019517 0.008239 -0.574238 -0.580464 0.255739 0.268184 0.269202 0.241787 0.240620 0.267860 0.214683 0.224464 0.229568 0.230625 0.218605 0.216454 0.206756 0.268212 0.235398 0.250335 0.234287 0.210129 0.218146 0.215749 0.213020 0.229683
chargesum: 0.00000
title: Mulliken charges with hydrogens summed into heavy atoms:
elementType: S P N N N C C C C C C C C C C C C
charge: -0.299217 0.675434 -0.397265 -0.380550 -0.448631 0.253681 0.248213 0.052703 0.066690 -0.034436 -0.038953 0.092365 0.054932 0.214769 0.218368 -0.140343 -0.137761
polarizability: 2.09399700e+02 -2.65059604e+00 2.01244936e+02 4.23699362e+00 -6.46054153e+00 1.68452425e+02
1716.lowfreq: -8.3068 0.0017 0.0019 0.0021 2.1633 4.2862 20.6417 28.8502 32.2854
frequency: 20.2253 28.7393 32.0835 45.0786 50.4772 61.7413 73.5802 75.8676 89.5359 118.9516 131.6807 143.0122 164.5695 179.7358 189.4239 204.1531 243.9047 250.8577 265.1705 279.2479 318.9375 346.7159 354.2827 377.9371 389.6554 400.7720 433.9408 437.7266 461.2311 484.6408 588.5105 591.1344 618.6775 667.0306 736.5774 746.7523 753.0699 829.0334 839.0510 886.2005 891.5109 899.0015 902.8901 929.9041 933.7447 951.3481 951.9761 968.9043 981.2115 994.8341 1001.8621 1026.9220 1031.7512 1036.5403 1065.5542 1074.5964 1106.0299 1117.5436 1121.3866 1140.4474 1145.0760 1154.6494 1163.7178 1168.9060 1171.1140 1238.8869 1244.5384 1257.0990 1276.6753 1287.0709 1313.8606 1334.4890 1355.3314 1375.1880 1377.1529 1395.5053 1399.5334 1424.2478 1427.2866 1451.4206 1452.2168 1454.8789 1456.2457 1461.7932 1464.8135 1470.5044 1474.4497 1653.1992 1654.3640 2968.6657 2978.2693 2982.4183 2984.4253 3050.4034 3051.2237 3059.6167 3061.2387 3064.7694 3067.6539 3072.2662 3076.0776 3080.1713 3083.6110 3096.8584 3097.1530 3098.1032 3107.8238 3178.2702 3179.3942 3193.7643 3194.8734
redmass: 3.6646 3.1960 3.7908 3.5319 3.7460 3.6109 2.5870 2.3710 3.7629 2.9263 3.9813 4.2031 2.4505 1.4190 1.3047 2.1679 3.2432 3.2512 2.8810 3.7056 4.4804 4.1592 2.6109 2.5286 2.3252 2.3702 3.2273 3.2002 2.3542 2.8959 4.9272 2.3229 5.3812 2.0357 4.2142 3.0045 4.0946 3.8411 3.6130 1.7656 1.2698 1.2477 1.5149 1.9884 2.1436 1.3801 1.3952 2.2206 2.3601 1.1424 1.1643 1.2983 1.7857 1.5099 1.3870 1.3857 2.3394 1.2848 1.2910 1.4499 1.5275 3.3571 1.7773 2.2090 1.7156 1.7001 1.6980 1.2087 1.2428 1.2991 1.2497 1.1971 1.2908 1.4661 1.5162 1.5122 1.4621 1.1874 1.1732 1.1323 1.1102 1.1147 1.0784 1.0946 1.0903 1.0468 1.0471 4.6055 4.6115 1.0645 1.0628 1.0360 1.0359 1.0964 1.0981 1.0877 1.0592 1.0844 1.0563 1.0988 1.0990 1.0676 1.0600 1.0861 1.0992 1.0990 1.0947 1.1163 1.1172 1.1141 1.1149
irintensity: 0.3376 0.2998 0.2515 0.6891 1.0527 0.1181 0.4197 0.6209 2.3686 0.9155 2.7739 4.7342 1.7119 1.4668 2.1939 3.6992 1.0991 2.5707 0.6485 0.1293 2.4321 9.5030 6.2008 6.6296 8.8032 0.6617 1.4568 0.5600 14.9046 4.3361 52.5095 52.9688 94.9630 17.3086 2.1391 26.1570 28.5595 104.3265 105.2729 45.0818 2.9158 11.9555 12.7753 10.8007 50.0830 44.8339 129.1771 57.0083 9.1129 13.5426 25.0804 52.5817 115.5684 0.9274 8.2464 1.9120 41.9630 0.6039 17.8640 4.8864 5.5688 45.6381 0.1737 8.1086 12.6713 16.6595 25.6887 15.9914 2.1870 1.5274 0.3219 2.5383 7.9794 6.3447 6.8635 16.2769 43.5195 13.2589 8.0380 8.0504 14.5957 48.6055 12.9558 9.7881 5.5021 0.7085 16.0374 6.8202 7.9528 41.5312 33.9370 29.1399 31.3342 3.0085 0.0704 1.5671 20.4920 11.6173 15.6918 37.6556 22.5759 14.1067 14.7145 9.8892 2.4025 44.3270 9.5126 4.8599 5.3415 23.2876 26.6457
temp: 298.150 k
press: 1.00000 atm
elementType: 16 15 7 7 7 6 6 6 6 6 6 6 6 6 6 6 6 1 1 1 1 1 1 1 1 1 1 1 1 1 1 1 1 1 1 1 1 1 1
symmnumber: 1
zpe: 844977.1 jmol-1
zpe.correction: 0.321835 hartree
zpe.thermalcorrener: 0.343647 hartree
zpe.thermalcorrenthalpy: 0.344591 hartree
zpe.thermalcorrgfe: 0.268358 hartree
zpe.sumelectzpe: -1372.537930 hartree
zpe.sumelectthermal: -1372.516118 hartree
zpe.sumelectthermalent: -1372.515174 hartree
zpe.sumelectthermalfe: -1372.591407 hartree
dipole: 0.8597 0.8352 -2.1316
dipole: 2.4455
quadrupole: -109.1079 -112.9994 -124.7105
quadrupole: 0.7683 1.1386 8.7246
quadrupole: 6.4980 2.6066 -9.1046 0.7683 1.1386 8.7246
hfenergy: -1372.8597652 hartree
pointgroup: C01 [X(C12H22N3P1S1)]
dipole: -0.1127812 0.057339 0.9537924 debye
polarizability: 208.1519725|6.5318694|196.3276617|-5.771867|13.0845557|174.6174269 unknown
InChI: InChI=1S/C12H22N3PS/c1-5-7-13(8-6-2)16(17,14-9-11(14)3)15-10-12(15)4/h5-6,11-12H,1-2,7-10H2,3-4H3
charge 0 multiplicity 1
39 atoms
S  -1.082744 -0.656234 -2.285071
P  -0.420179 -0.109028 -0.364931
N  -1.269237 1.250804 0.443287
N  -0.613728 -1.337855 0.940551
N  1.23073 0.40472 -0.288914
C  -2.78715 1.312826 0.354925
C  -1.754874 -2.343123 0.821122
C  -1.93784 2.283987 -0.444631
C  -0.327724 -2.784125 0.565029
C  -3.513347 1.705642 1.625683
C  -2.495871 -2.664766 2.103617
C  1.782156 0.945036 0.982711
C  2.174318 0.10002 -1.392193
C  2.305056 2.357756 0.802886
C  2.901154 -1.222676 -1.212809
C  3.585228 2.741073 1.036651
C  2.886789 -2.228208 -2.123148
H  -3.2593 0.523468 -0.250204
H  -2.367214 -2.243988 -0.088918
H  -1.884027 2.126965 -1.530735
H  -1.813537 3.314176 -0.095568
H  0.219025 -3.336909 1.336192
H  -0.039526 -2.993728 -0.473715
H  -4.525162 2.085613 1.391406
H  -3.615285 0.838269 2.302973
H  -2.958003 2.493058 2.163457
H  -1.797448 -2.704424 2.957047
H  -3.258872 -1.89512 2.32204
H  -3.006448 -3.642236 2.019837
H  2.587158 0.283731 1.362963
H  0.967014 0.941178 1.72877
H  2.89996 0.936952 -1.431774
H  1.612596 0.096727 -2.343487
H  1.560511 3.088054 0.454423
H  3.467892 -1.346145 -0.277072
H  3.909673 3.779588 0.906116
H  4.345357 2.025625 1.376908
H  3.434596 -3.163604 -1.958758
H  2.321205 -2.141299 -3.058965
