program: Gaussian 09
title: 000096854
version: EM64L-G09RevD.01
frameworkgroup: C1[X(C14H8Cl2N2O)]
method: RPBEPBE
basis: SDD
operation: Freq
keyword: #p
keyword: freq=noraman
keyword: PBEPBE/SDD
title: #p freq=noraman PBEPBE/SDD
converged: YES YES NO NO
title: Mulliken charges:
elementType: Cl Cl O N N C C C C C C C C C C C C C C H H H H H H H H
charge: 0.026750 -0.027612 -0.280058 -0.085144 -0.130305 0.450863 0.298142 0.101119 0.127886 -0.293001 -0.339074 -0.360685 -0.345815 -0.211683 -0.216121 -0.100887 -0.219940 -0.221693 -0.228805 0.270247 0.251818 0.276349 0.286372 0.264574 0.233772 0.236790 0.236139
chargesum: 0.00000
title: Mulliken charges with hydrogens summed into heavy atoms:
elementType: Cl Cl O N N C C C C C C C C C C C C C C
charge: 0.026750 -0.027612 -0.280058 -0.085144 -0.130305 0.450863 0.298142 0.101119 0.127886 -0.293001 -0.068826 -0.108867 -0.069466 0.074688 0.048453 -0.100887 0.013832 0.015098 0.007335
polarizability: 3.67840751e+02 5.59698552e+00 2.03897528e+02 -4.76942997e-02 -7.47223028e-02 6.88025654e+01
1716.lowfreq: -6.3889 -0.0021 -0.0017 -0.0013 1.0115 5.5258 10.8450 34.7372 54.8275
frequency: 10.8295 34.7309 54.8272 65.5260 96.2391 138.2196 162.4300 169.7386 174.3222 221.3365 273.1856 283.3758 357.9479 361.3068 380.4610 401.1942 429.2335 450.0817 489.3890 516.4239 536.9675 551.8208 613.6996 656.3628 656.4690 683.5093 684.4158 697.8022 729.0852 770.3852 781.8018 829.5564 859.5143 871.3156 878.6994 897.7187 942.1595 942.7424 961.2933 966.9377 988.9857 990.5862 1007.4469 1015.5004 1035.3180 1064.9976 1087.5074 1091.4189 1147.9593 1176.1850 1186.2920 1191.6896 1257.9714 1259.9708 1325.0157 1355.3172 1377.4547 1385.6914 1432.7264 1436.6643 1451.8610 1513.9694 1529.2710 1557.3578 1587.1874 1595.3135 1616.8966 3134.1507 3145.1206 3156.6576 3166.2949 3169.2704 3175.2384 3184.9847 3188.3082
redmass: 6.8798 5.1564 7.5096 8.1065 7.0493 8.9619 5.8472 13.5771 7.4137 9.5084 6.3489 12.0849 10.0727 6.5071 9.8613 2.8223 6.9317 3.4015 3.8964 8.3595 8.0862 5.0631 6.4756 7.4887 7.4040 6.8110 5.3838 1.8784 3.9838 9.3701 1.9022 1.4401 1.2483 1.4225 14.2622 13.6496 11.2913 1.4162 9.4914 1.3589 6.2625 1.3830 1.3339 4.4458 2.5746 2.7131 1.6896 3.4690 1.4127 1.0559 2.1819 1.4686 1.3269 4.5019 1.3658 3.7854 6.2363 8.3756 2.7049 2.5648 2.4802 6.1163 5.8412 8.6181 6.2491 7.1339 6.0321 1.0855 1.0887 1.0931 1.0966 1.0886 1.1013 1.0938 1.0972
irintensity: 0.4170 0.0450 0.2966 2.7607 0.0058 0.1538 0.0512 1.1701 0.0007 0.2857 0.0015 0.2196 3.1964 0.1915 4.5920 0.0161 3.9712 9.4173 3.0753 27.6746 0.6591 2.8508 0.0768 0.0251 1.7243 12.9262 39.0946 47.5370 7.4509 48.4127 37.7378 44.0066 0.0002 18.0507 14.6474 20.5578 14.3992 5.1316 41.0158 0.7158 0.0255 0.0596 0.3570 4.5210 29.4532 6.5717 8.5392 56.1225 11.4786 0.0388 0.3095 10.7553 0.6873 2.1075 1.5389 14.4106 16.1136 0.5630 181.3642 38.3407 55.7949 11.2228 27.4608 39.2372 1.5458 87.8188 7.9973 0.2406 7.6734 18.0210 12.5034 0.4032 19.7774 0.3952 1.1234
temp: 298.150 k
press: 1.00000 atm
elementType: 17 17 8 7 7 6 6 6 6 6 6 6 6 6 6 6 6 6 6 1 1 1 1 1 1 1 1
symmnumber: 1
zpe: 481913.4 jmol-1
zpe.correction: 0.183551 hartree
zpe.thermalcorrener: 0.199137 hartree
zpe.thermalcorrenthalpy: 0.200082 hartree
zpe.thermalcorrgfe: 0.137276 hartree
zpe.sumelectzpe: -1641.802433 hartree
zpe.sumelectthermal: -1641.786847 hartree
zpe.sumelectthermalent: -1641.785903 hartree
zpe.sumelectthermalfe: -1641.848709 hartree
dipole: 2.1005 -4.4236 0.0011
dipole: 4.8970
quadrupole: -102.9231 -123.1025 -126.8570
quadrupole: -7.3233 -0.0103 -0.0128
quadrupole: 14.7044 -5.4750 -9.2295 -7.3233 -0.0103 -0.0128
hfenergy: -1641.9859842 hartree
pointgroup: C01 [X(C14H8Cl2N2O1)]
dipole: -0.82995 -1.7386538 0.0117254 debye
polarizability: 367.7895671|-5.9009463|203.9033154|2.9344533|-1.556819|68.8479623 unknown
InChI: InChI=1S/C14H8Cl2N2O/c15-10-6-7-11(12(16)8-10)14-18-17-13(19-14)9-4-2-1-3-5-9/h1-8H
charge 0 multiplicity 1
27 atoms
Cl 3.060317 2.809114 -0.006785
Cl 6.17406 -1.717839 0.080288
O  -0.485786 -0.222209 -0.003785
N  0.104694 1.98547 -0.021275
N  -1.326167 1.89653 -0.034156
C  1.937522 0.200444 0.015842
C  -2.963057 -0.023636 -0.029647
C  0.578097 0.731371 -0.003542
C  -1.64274 0.593402 -0.023496
C  3.11537 1.002252 0.016733
C  2.111723 -1.216924 0.035652
C  -3.114444 -1.436694 -0.019004
C  -4.114229 0.812531 -0.046561
C  4.401004 0.42414 0.036232
C  3.383472 -1.813185 0.055294
C  4.517699 -0.976747 0.055288
C  -4.404808 -2.004608 -0.025154
C  -5.398645 0.23543 -0.052624
C  -5.549131 -1.172694 -0.04192
H  1.220075 -1.848868 0.035424
H  -2.226543 -2.076613 -0.006191
H  -3.980747 1.898893 -0.054593
H  5.287454 1.062462 0.036453
H  3.491372 -2.900605 0.070246
H  -4.519084 -3.093749 -0.016963
H  -6.283149 0.880947 -0.065612
H  -6.55023 -1.617313 -0.046646
