program: Gaussian 09
title: 000096843
version: EM64L-G09RevD.01
frameworkgroup: C1[X(C14H9FN2O)]
method: RPBEPBE
basis: SDD
operation: Freq
keyword: #p
keyword: freq=noraman
keyword: PBEPBE/SDD
title: #p freq=noraman PBEPBE/SDD
converged: NO NO NO NO
title: Mulliken charges:
elementType: F O N N C C C C C C C C C C C C C C H H H H H H H H H
charge: -0.201052 -0.265458 -0.126142 -0.128913 0.338711 0.301661 0.121886 0.122230 -0.504734 -0.366733 -0.361975 -0.346673 0.347021 -0.179189 -0.219933 -0.222696 -0.378382 -0.229498 0.281232 0.278897 0.255647 0.275160 0.240919 0.234050 0.235962 0.262337 0.235663
chargesum: 0.00000
title: Mulliken charges with hydrogens summed into heavy atoms:
elementType: F O N N C C C C C C C C C C C C C C
charge: -0.201052 -0.265458 -0.126142 -0.128913 0.338711 0.301661 0.121886 0.122230 -0.223502 -0.087836 -0.106328 -0.071513 0.347021 0.061731 0.014118 0.013266 -0.116045 0.006164
polarizability: 3.24161690e+02 -1.11328276e+01 1.73550188e+02 -4.03329040e-03 1.06448163e-02 6.40413625e+01
1716.lowfreq: -0.0005 -0.0003 0.0006 4.5561 10.0989 12.0717 32.6015 43.4652 57.1392
frequency: 32.5389 43.4649 57.1390 95.2184 119.5550 146.7192 228.3127 235.0776 244.1775 320.6026 321.6600 392.8810 401.7775 423.3503 444.9767 488.2422 495.3291 527.6470 562.5592 613.7843 661.7608 667.3369 684.7820 687.4674 698.2504 707.7953 781.5502 803.9703 840.1860 860.3686 888.3178 892.8921 902.7719 915.3549 943.2565 957.9082 986.7419 988.5075 990.7126 990.9613 991.3359 1007.2903 1024.0897 1048.2415 1084.8766 1090.1325 1150.7604 1176.1460 1177.4907 1190.4955 1215.4021 1265.0954 1294.8312 1325.8000 1384.1840 1387.8081 1408.6032 1432.9839 1449.1588 1462.6638 1518.7086 1532.6160 1585.9319 1589.8649 1616.2930 1621.8734 3132.5435 3143.6779 3150.7883 3155.2790 3165.0327 3171.2427 3173.7678 3177.6293 3182.5454
redmass: 4.6506 4.8941 6.7856 9.7825 5.4378 6.2459 5.7947 5.2095 6.2552 10.2090 6.4683 8.5786 2.8272 5.9483 3.1364 3.7869 8.7807 7.4847 5.5655 6.4735 7.2854 7.0376 2.8882 6.9571 1.9873 3.3752 1.8796 1.4259 8.2182 1.2477 13.4255 1.5384 12.6044 1.3840 1.4143 10.2142 6.3506 6.2302 5.6073 1.3427 1.3829 1.3317 2.5507 2.4771 1.5830 1.6403 1.9394 1.0562 1.2245 1.1224 5.1311 3.2007 1.6791 1.3769 7.8987 7.9617 3.2962 2.5296 2.4972 2.8663 5.1242 6.4297 6.2301 6.8565 6.0114 6.7507 1.0855 1.0888 1.0879 1.0931 1.0966 1.0931 1.1013 1.0934 1.0992
irintensity: 1.2662 1.7554 0.8283 1.7586 0.0041 1.4685 0.0254 0.1291 0.2525 1.2479 0.0300 0.6262 0.0039 0.4696 3.7142 3.1691 4.7862 3.6296 2.9009 0.0068 0.0422 9.5839 0.9976 13.1327 33.5509 77.7013 34.5818 51.5217 55.4978 0.1057 1.5783 31.1348 45.5189 0.2684 6.2179 3.6997 0.4456 0.9881 3.7530 1.6888 0.0513 0.3957 6.5294 12.4282 3.8611 8.4728 26.1541 0.0206 2.9319 8.0436 25.7241 7.3766 1.0352 1.3981 1.0903 0.5233 53.4533 74.9658 43.5321 106.6779 35.8096 11.9556 2.7332 36.3798 6.5074 19.7753 0.1766 8.2464 9.7518 17.4218 12.1640 0.7210 18.9009 0.0919 6.2968
temp: 298.150 k
press: 1.00000 atm
elementType: 9 8 7 7 6 6 6 6 6 6 6 6 6 6 6 6 6 6 1 1 1 1 1 1 1 1 1
symmnumber: 1
zpe: 511589.5 jmol-1
zpe.correction: 0.194854 hartree
zpe.thermalcorrener: 0.208649 hartree
zpe.thermalcorrenthalpy: 0.209594 hartree
zpe.thermalcorrgfe: 0.152522 hartree
zpe.sumelectzpe: -822.203814 hartree
zpe.sumelectthermal: -822.190019 hartree
zpe.sumelectthermalent: -822.189075 hartree
zpe.sumelectthermalfe: -822.246147 hartree
dipole: -0.7254 1.7092 0.0017
dipole: 1.8567
quadrupole: -74.5314 -108.5622 -107.2877
quadrupole: -12.8029 -0.0008 -0.0053
quadrupole: 22.2624 -11.7685 -10.4939 -12.8029 -0.0008 -0.0053
hfenergy: -822.3986686 hartree
pointgroup: C01 [X(C14H9F1N2O1)]
dipole: -0.2896042 -0.6706397 -0.0006632 debye
polarizability: 324.2954174|10.187302|173.4164607|0.0041|0.0106193|64.0413625 unknown
InChI: InChI=1S/C14H9FN2O/c15-12-8-4-7-11(9-12)14-17-16-13(18-14)10-5-2-1-3-6-10/h1-9H
charge 0 multiplicity 1
27 atoms
F  4.236776 -2.690612 0.000121
O  -0.207915 -0.120767 -0.000034
N  0.343293 2.094946 0.000813
N  -1.084243 1.987983 0.000859
C  2.223375 0.41199 0.000183
C  -2.691733 0.040108 -0.000006
C  0.831532 0.844681 0.00036
C  -1.381412 0.677236 0.000257
C  2.55225 -0.969311 0.000249
C  3.253918 1.393288 -0.000052
C  -2.819942 -1.375486 -0.00016
C  -3.855833 0.858263 -0.00006
C  3.9085 -1.325109 0.000083
C  4.604132 0.99058 -0.000229
C  -4.101692 -1.963269 -0.000387
C  -5.131338 0.261045 -0.000286
C  4.951354 -0.381186 -0.000164
C  -5.259655 -1.149601 -0.000454
H  1.776596 -1.740056 0.000416
H  2.978694 2.451952 -0.000118
H  -1.921814 -2.00141 -0.000092
H  -3.740238 1.946849 0.000083
H  5.396444 1.745719 -0.00042
H  -4.197892 -3.054361 -0.000505
H  -6.025485 0.893587 -0.000332
H  5.993333 -0.714441 -0.000285
H  -6.253604 -1.610417 -0.000642
