program: Gaussian 09
title: 000097146
version: EM64L-G09RevD.01
frameworkgroup: C1[X(C20H26N4O6S2)]
method: RPBEPBE
basis: SDD
operation: Freq
keyword: #p
keyword: freq=noraman
keyword: PBEPBE/SDD
title: #p freq=noraman PBEPBE/SDD
converged: YES YES NO NO
title: Mulliken charges:
elementType: S S O O O O O O N N N N C C C C C C C C C C C C C C C C C C C C H H H H H H H H H H H H H H H H H H H H H H H H H H
charge: 0.963635 0.978839 -0.310103 -0.352623 -0.509645 -0.553572 -0.534957 -0.478893 -0.398783 -0.368981 -0.731029 -0.643664 -0.390087 -0.376673 -0.440125 -0.380572 -0.341420 -0.386410 0.380974 0.406414 -0.001074 -0.005054 -0.201404 -0.262906 -0.278434 -0.276196 -0.224317 -0.204236 -0.206148 -0.204245 -0.214869 -0.233750 0.218049 0.217237 0.214238 0.192352 0.199175 0.222851 0.201188 0.208702 0.238154 0.231296 0.249950 0.234228 0.355819 0.299398 0.418911 0.330544 0.320398 0.283239 0.299600 0.340652 0.241515 0.241347 0.240849 0.303158 0.234872 0.242582
chargesum: 0.00000
title: Mulliken charges with hydrogens summed into heavy atoms:
elementType: S S O O O O O O N N N N C C C C C C C C C C C C C C C C C C C C
charge: 0.963635 0.978839 -0.310103 -0.352623 -0.509645 -0.553572 -0.534957 -0.478893 -0.042964 -0.069583 -0.312117 -0.313120 0.045199 0.029916 -0.018099 0.029319 0.128031 0.097768 0.380974 0.406414 -0.001074 -0.005054 0.118994 0.020333 0.021166 0.064456 0.017198 0.037110 0.034701 0.098914 0.020003 0.008832
chargesum: -0.00010
polarizability: 3.65868607e+02 6.69359672e+00 2.78259809e+02 -8.53614355e+00 -7.73774993e+00 3.04945496e+02
1716.lowfreq: -6.9022 -3.8637 -2.5026 -1.8994 -0.1462 -0.0615 16.4821 17.7844 21.1123
frequency: 16.2794 17.6292 21.0685 26.3013 34.7951 43.8263 49.9181 52.2163 60.3862 66.6217 76.3126 82.4533 89.7118 104.8520 111.0520 119.4675 128.9949 148.8855 152.2661 165.5185 171.4299 203.2058 206.7570 223.9769 228.7364 232.8086 245.4437 248.0480 252.9054 258.1383 274.1190 279.3825 297.7979 311.7296 347.5031 355.3443 378.4465 391.7170 400.2485 404.0671 410.2259 414.2730 439.0607 444.6404 461.8674 489.0670 498.9987 509.9376 553.2007 580.7249 597.1357 601.7747 638.6816 645.7001 654.7717 669.5013 681.7706 685.1128 688.5175 690.5812 704.5689 719.4779 729.8966 761.2564 766.3991 772.4379 790.7561 805.0592 817.9218 832.5874 847.4101 849.0863 864.8149 890.9311 921.8138 933.7688 935.3399 949.8619 962.8605 971.6335 973.4358 978.6085 982.1205 984.2785 995.4822 1002.0020 1003.4106 1004.1153 1007.3415 1027.6272 1042.8083 1046.5629 1048.7325 1065.4974 1079.6464 1084.2946 1090.8886 1105.6900 1116.1952 1123.3468 1164.0688 1172.6827 1174.3033 1181.5097 1183.4258 1197.0326 1205.0126 1214.3878 1225.5678 1253.9631 1281.4679 1285.8703 1305.1010 1311.5271 1312.6412 1327.2933 1338.5168 1342.6586 1346.0009 1356.3650 1367.0913 1375.2369 1382.4626 1383.9162 1437.6301 1440.2448 1454.0932 1455.7896 1457.0004 1461.4415 1463.5094 1472.0506 1486.7622 1492.8058 1497.4793 1516.5333 1566.5075 1575.0105 1588.7829 1602.7027 1603.3919 1636.4934 2966.3996 2968.6172 2974.2178 2980.5632 2984.9721 3005.1323 3015.0495 3029.1497 3033.3775 3041.4002 3056.0298 3089.1447 3122.5486 3136.2421 3138.4005 3148.1572 3149.1380 3157.6966 3159.9582 3166.1417 3172.9763 3174.2086 3331.6596 3452.6866 3474.6296 3545.2238
redmass: 5.5920 5.4570 5.5502 5.1059 6.7292 7.1897 5.0207 6.1680 5.0627 4.7164 5.2467 5.1279 5.1576 5.5533 6.4630 7.3070 6.8982 7.4698 6.4145 4.3100 3.2855 5.0025 3.4880 5.8717 6.2330 3.8269 3.8727 8.8531 6.3845 4.0290 4.8675 6.3362 3.6374 2.9011 7.2196 7.7850 2.5080 2.3685 6.7180 2.8994 2.9530 2.8390 3.6577 5.7832 3.3517 2.6347 3.9919 2.7995 1.4436 1.1241 6.4243 6.4804 3.6030 4.9821 6.2404 2.4577 6.1617 4.0313 3.0640 3.0080 2.4281 1.7572 4.6183 1.5018 1.5902 1.4372 1.7597 10.0334 13.4359 1.8362 1.2483 2.5017 1.2389 2.0383 2.6658 4.5930 1.6563 1.3281 11.7966 6.3929 4.1330 2.3437 3.4180 1.5265 1.3713 2.0811 1.4037 4.4226 4.5780 1.3470 2.0246 2.0858 2.1482 2.2137 1.5732 1.5849 2.6180 2.7441 2.7535 2.7818 1.4852 1.0601 1.0829 1.3583 1.1320 1.1140 1.6258 1.5007 1.2365 1.2934 1.1974 1.2186 1.1341 1.2819 1.3065 1.6945 1.4038 1.3817 1.3383 1.3908 1.4372 1.7981 7.8378 5.7399 2.2773 2.2578 1.9675 1.9176 1.1312 1.0868 1.1106 1.1008 1.1342 1.1091 1.5770 1.6423 5.5592 5.6786 5.6530 6.9197 6.7948 5.2599 1.0626 1.0629 1.0633 1.0638 1.0601 1.0678 1.0971 1.0993 1.0987 1.1010 1.1006 1.0964 1.0929 1.0859 1.0886 1.0927 1.0889 1.0931 1.0951 1.0969 1.1004 1.1016 1.0814 1.0799 1.0783 1.0773
irintensity: 0.8591 0.4334 0.6090 1.4841 0.9658 1.3753 1.6991 0.8446 0.3252 1.0505 2.2168 7.1161 0.1725 1.7051 4.9357 2.7710 4.5858 1.7697 1.4036 7.5761 5.6646 1.3738 3.9049 7.3207 1.7067 2.0162 0.4055 6.9205 9.7097 9.0915 8.2107 10.7774 15.8699 5.6725 1.7392 5.5398 4.3523 31.1052 16.8812 0.4247 0.7227 23.0538 50.4353 94.4829 56.4528 32.6476 59.0164 64.3973 165.6287 42.6146 0.0163 0.7014 37.5980 10.5165 7.6174 67.7475 65.0692 15.0656 53.1082 68.3684 89.2490 57.3093 16.4198 53.8137 120.5790 77.5372 28.7848 149.1561 92.9369 0.8119 2.2426 6.9378 2.7089 2.7928 6.9268 60.9123 6.9582 7.1894 72.0746 1.7464 5.3608 11.2834 32.6434 1.5761 0.6406 13.1211 4.4782 2.8164 1.5369 1.2660 20.5959 27.1455 9.9529 9.9649 4.6673 5.3276 6.8513 8.3719 24.9069 13.5306 26.2243 1.2602 3.1759 38.7322 15.6883 9.2114 150.8462 56.5437 8.6840 17.0799 0.7257 2.6164 1.0493 5.2691 8.3581 277.7952 39.4353 16.5414 3.6560 19.3551 31.7467 108.9547 4.0313 36.2412 20.0897 31.9258 34.5851 21.7085 89.2405 18.1080 19.7887 15.3444 32.7611 20.9822 244.9409 266.1111 1.4027 9.5131 448.8639 0.1828 0.1291 182.5943 10.3754 20.6150 31.4559 42.5834 48.5348 39.2741 13.3895 32.3825 44.6164 14.3378 119.7425 8.5521 23.6740 2.9545 26.5068 5.9389 18.8326 2.9183 11.6331 0.9966 22.2067 46.8098 413.1882 216.2494 24.8194 31.9697
temp: 298.150 k
press: 1.00000 atm
elementType: 16 16 8 8 8 8 8 8 7 7 7 7 6 6 6 6 6 6 6 6 6 6 6 6 6 6 6 6 6 6 6 6 1 1 1 1 1 1 1 1 1 1 1 1 1 1 1 1 1 1 1 1 1 1 1 1 1 1
symmnumber: 1
zpe: 1169923.4 jmol-1
zpe.correction: 0.445600 hartree
zpe.thermalcorrener: 0.479156 hartree
zpe.thermalcorrenthalpy: 0.480101 hartree
zpe.thermalcorrgfe: 0.376769 hartree
zpe.sumelectzpe: -2241.496896 hartree
zpe.sumelectthermal: -2241.463340 hartree
zpe.sumelectthermalent: -2241.462396 hartree
zpe.sumelectthermalfe: -2241.565728 hartree
dipole: -2.6775 8.4121 -0.1120
dipole: 8.8286
quadrupole: -179.8655 -202.6391 -196.1605
quadrupole: -13.2877 -18.6519 -19.2810
quadrupole: 13.0228 -9.7508 -3.2721 -13.2877 -18.6519 -19.2810
hfenergy: -2241.9424966 hartree
pointgroup: C01 [X(C20H26N4O6S2)]
dipole: 0.3176096 -0.2585956 -3.449206 debye
polarizability: 365.6269527|-7.4717328|302.5697203|-11.2264965|-8.6008812|280.8772391 unknown
InChI: InChI=1S/C20H26N4O6S2/c25-19(23-31(27,28)17-11-5-3-6-12-17)21-15-9-1-2-10-16-22-20(26)24-32(29,30)18-13-7-4-8-14-18/h3-8,11-14,21-24H,1-2,9-10,15-16H2
charge 0 multiplicity 1
58 atoms
S  -1.861687 0.086583 1.815372
S  3.730541 1.665929 1.12083
O  -2.295025 -2.173793 -0.345695
O  1.361635 0.796363 -0.944485
O  -1.788129 -1.23318 2.75863
O  -1.102772 1.450301 2.296295
O  5.341885 1.848427 1.226926
O  2.716367 2.828155 1.59944
N  -0.181717 -1.760862 -1.281055
N  2.382559 1.956029 -2.705944
N  -1.079058 -0.226281 0.210999
N  3.594093 1.471264 -0.755675
C  0.554045 -1.271635 -4.151662
C  1.842094 -0.514774 -4.56263
C  0.819613 -2.591327 -3.375715
C  1.594024 0.975582 -4.899977
C  -0.222465 -2.855129 -2.265738
C  1.259431 1.842364 -3.658518
C  -1.25151 -1.461773 -0.463454
C  2.376436 1.39036 -1.442186
C  -3.664822 0.515981 1.438261
C  3.204661 0.007906 1.834106
C  -4.542893 -0.504521 1.04172
C  4.171157 -1.011106 1.856276
C  -4.026338 1.859368 1.624507
C  1.901565 -0.099975 2.341153
C  -5.890378 -0.134879 0.819256
C  3.780259 -2.247262 2.419483
C  -5.379837 2.200753 1.396073
C  1.533561 -1.352701 2.89085
C  -6.30472 1.207097 0.997093
C  2.467927 -2.414489 2.924709
H  -0.060467 -1.474042 -5.050566
H  -0.057609 -0.613173 -3.505809
H  2.315625 -1.016837 -5.429098
H  2.579286 -0.570941 -3.735474
H  1.825178 -2.5491 -2.907847
H  0.835583 -3.459914 -4.060018
H  2.480816 1.402825 -5.411008
H  0.749424 1.065456 -5.612763
H  -1.246367 -2.915847 -2.680224
H  -0.019569 -3.826001 -1.771409
H  0.410424 1.421384 -3.095559
H  0.969426 2.861501 -3.978328
H  0.639687 -1.145066 -1.247395
H  3.194766 2.502505 -2.99832
H  -0.253208 0.374692 0.029004
H  4.434183 1.893049 -1.173822
H  -4.178562 -1.523978 0.880868
H  5.181582 -0.841865 1.471586
H  -3.280331 2.594859 1.942656
H  1.198528 0.74229 2.32442
H  -6.610085 -0.897085 0.503613
H  4.499475 -3.071684 2.463263
H  -5.706185 3.236875 1.53291
H  0.512796 -1.488193 3.265225
H  -7.351671 1.47962 0.824208
H  2.170274 -3.378803 3.350338
