program: Gaussian 09
title: 000096814
version: EM64L-G09RevD.01
frameworkgroup: C1[X(C12H16N2O3)]
method: RPBEPBE
basis: SDD
operation: Freq
keyword: #p
keyword: freq=noraman
keyword: PBEPBE/SDD
title: #p freq=noraman PBEPBE/SDD
converged: YES YES NO NO
title: Mulliken charges:
elementType: O O O N N C C C C C C C C C C C C H H H H H H H H H H H H H H H H
charge: -0.422288 -0.296501 -0.218898 -0.373382 -0.602213 -0.150237 -0.562812 0.514864 -0.192146 0.263794 0.151989 -0.385980 -0.419248 -0.691062 -0.253580 -0.229596 -0.243468 0.290436 0.211876 0.263728 0.307721 0.220382 0.263299 0.226821 0.215316 0.235037 0.220990 0.230859 0.225166 0.267306 0.314204 0.228765 0.388859
chargesum: 0.00000
title: Mulliken charges with hydrogens summed into heavy atoms:
elementType: O O O N N C C C C C C C C C C C C
charge: -0.033428 -0.296501 -0.218898 -0.065661 -0.020702 0.140199 -0.087208 0.514864 0.028235 0.263794 0.151989 -0.122682 -0.192427 -0.019719 -0.022721 -0.004430 -0.014703
polarizability: 1.63723215e+02 -1.47811628e+01 1.56993864e+02 -5.20700723e+00 -1.38566831e+01 1.21833935e+02
1716.lowfreq: -18.3236 -6.9406 -4.6059 -0.0006 -0.0004 0.0006 3.9517 21.2336 38.1398
frequency: -8.2699 20.9453 37.9894 44.3554 61.3050 70.6910 90.9727 132.8302 166.5191 196.8952 226.7314 237.9172 253.2971 274.9923 303.5062 330.4495 341.0496 403.4894 424.8303 436.1643 464.6178 537.8530 548.8580 559.7317 581.3013 601.1708 615.4915 624.2039 651.6847 693.3232 702.2928 709.0204 737.3796 797.0398 837.5597 853.4425 870.3140 885.9955 922.3950 929.5053 976.7449 990.0918 996.5706 1004.1109 1024.9906 1034.8840 1053.0149 1077.3157 1091.5753 1116.1043 1157.6377 1173.2035 1186.1941 1197.8767 1206.6603 1215.9422 1239.1824 1273.2823 1300.3581 1306.4736 1312.7843 1321.0686 1353.8068 1364.4842 1381.9618 1383.1508 1439.1779 1460.2774 1466.5456 1468.7149 1488.3090 1497.3778 1585.0950 1592.7928 1615.4287 1642.7714 1661.7430 2940.4693 2972.6039 2977.0400 3020.7824 3036.4893 3069.5039 3086.8839 3111.0384 3126.2465 3136.2379 3147.1281 3163.7212 3461.4771 3515.4688 3556.5118 3605.8660
redmass: 7.4056 4.5294 4.0600 4.0662 4.7715 4.9842 5.5034 3.8373 5.7041 3.3137 2.5034 1.2268 1.3037 3.1690 3.7426 3.0522 4.0608 2.8163 3.4959 2.8006 2.8758 4.7659 3.5334 1.6675 1.4199 1.8228 5.3544 2.0640 3.3661 3.3502 2.2217 4.1605 1.4509 4.9641 3.6041 1.2734 1.8456 3.0701 2.1586 1.8337 1.4399 4.2235 1.4186 1.5123 2.6289 2.3882 2.4244 2.2765 1.7190 3.8891 1.1870 1.0590 1.6373 1.2528 2.1028 1.9367 1.8005 1.5053 1.3391 1.4794 1.4571 1.5203 1.3093 1.4819 1.7295 2.5864 1.9879 1.1653 1.0484 1.0858 2.2228 1.9288 2.0590 5.7297 5.7635 1.7226 9.1600 1.0842 1.0347 1.0597 1.0895 1.0937 1.0996 1.1009 1.0875 1.0863 1.0915 1.0960 1.1015 1.0460 1.0640 1.0775 1.0974
irintensity: 1.1139 0.5654 2.9837 2.4204 0.8953 7.6179 0.5159 2.1776 0.5415 2.7319 8.6600 1.7517 46.3260 0.7202 10.1891 1.0662 14.2337 0.2404 12.6210 11.5615 10.1625 35.6870 24.6274 7.1220 143.9257 283.0723 26.3409 63.3722 7.2653 38.6472 43.8394 13.9718 57.0238 9.5087 1.3758 0.4296 11.3568 43.9907 13.2282 23.1771 0.1089 0.2881 0.4466 0.7811 2.5953 15.2040 12.7456 215.9024 4.9495 9.8184 13.5551 0.2340 18.2843 12.8586 8.8712 3.7341 78.4522 19.3715 15.4536 30.7611 0.2898 14.6251 3.6140 7.0566 10.1239 2.6074 4.8667 45.2404 12.4257 3.3564 23.9539 215.4647 180.7716 0.4458 9.0940 32.2088 238.0649 55.4843 26.1821 20.1268 10.3394 12.9638 41.1298 27.4331 9.5506 0.3367 15.3738 27.7002 24.5032 16.9252 33.5561 22.1381 11.8853
temp: 298.150 k
press: 1.00000 atm
elementType: 8 8 8 7 7 6 6 6 6 6 6 6 6 6 6 6 6 1 1 1 1 1 1 1 1 1 1 1 1 1 1 1 1
symmnumber: 1
zpe: 698399.5 jmol-1
zpe.correction: 0.266006 hartree
zpe.thermalcorrener: 0.282678 hartree
zpe.thermalcorrenthalpy: 0.283622 hartree
zpe.thermalcorrgfe: 0.219903 hartree
zpe.sumelectzpe: -800.789848 hartree
zpe.sumelectthermal: -800.773177 hartree
zpe.sumelectthermalent: -800.772233 hartree
zpe.sumelectthermalfe: -800.835951 hartree
dipole: -1.6820 0.7161 -3.7477
dipole: 4.1698
quadrupole: -87.2017 -102.8655 -101.4112
quadrupole: -1.2824 3.7130 -8.0841
quadrupole: 9.9578 -5.7061 -4.2517 -1.2824 3.7130 -8.0841
hfenergy: -801.0558547 hartree
pointgroup: C01 [X(C12H16N2O3)]
dipole: 0.7980442 0.1714652 -1.4230634 debye
polarizability: 168.3022964|-14.421573|144.3128685|2.4376982|18.8154027|129.9358494 unknown
InChI: InChI=1S/C12H16N2O3/c1-8(13)11(15)14-10(12(16)17)7-9-5-3-2-4-6-9/h2-6,8,10,14,16H,7,13H2,1H3
charge 0 multiplicity 1
33 atoms
O  2.910781 -1.736229 -0.995919
O  1.067166 1.051247 1.790768
O  1.84013 -3.378792 0.249308
N  1.168239 0.181063 -0.364431
N  1.523732 3.595311 0.86895
C  0.766568 -1.165689 0.032518
C  -0.523944 -1.674028 -0.682875
C  -1.760048 -0.798701 -0.500016
C  1.95109 2.496859 -0.000807
C  1.34577 1.194315 0.558534
C  1.866484 -2.209871 -0.187321
C  -1.99239 -0.034367 0.671833
C  -2.748709 -0.797273 -1.518042
C  3.501133 2.325438 -0.099367
C  -3.189876 0.701066 0.822254
C  -3.947235 -0.065366 -1.368246
C  -4.173464 0.686925 -0.192613
H  0.587231 -1.122818 1.123222
H  -0.314614 -1.792734 -1.764731
H  -0.721684 -2.691417 -0.291062
H  1.429451 0.343253 -1.338254
H  1.557396 2.64898 -1.028908
H  -1.239313 0.013125 1.466405
H  -2.579963 -1.378145 -2.434128
H  3.786222 1.503133 -0.782995
H  3.923365 2.11423 0.899402
H  3.95365 3.259793 -0.479907
H  -3.347975 1.292106 1.731155
H  -4.698739 -0.079361 -2.165847
H  2.102361 4.436165 0.824557
H  1.300528 3.281756 1.819972
H  -5.099649 1.259973 -0.07274
H  3.581007 -2.462546 -1.118467
