program: Gaussian 09
title: 000096831
version: EM64L-G09RevD.01
frameworkgroup: C1[X(C21H19ClO2)]
method: RPBEPBE
basis: SDD
operation: Freq
keyword: #p
keyword: freq=noraman
keyword: PBEPBE/SDD
title: #p freq=noraman PBEPBE/SDD
converged: YES YES NO NO
title: Mulliken charges:
elementType: Cl O O C C C C C C C C C C C C C C C C C C C C C H H H H H H H H H H H H H H H H H H H
charge: -0.114487 -0.261856 -0.263372 -0.439208 0.417424 0.416173 0.409094 -0.320532 -0.355975 -0.382900 -0.349119 -0.386363 -0.348879 -0.374337 -0.375584 -0.379856 -0.378986 0.317991 0.316895 -0.242793 -0.244747 -0.240736 -0.537792 -0.537452 0.275527 0.261720 0.257603 0.272722 0.261216 0.272755 0.253036 0.251605 0.240883 0.242508 0.227565 0.228538 0.228834 0.221463 0.223065 0.246797 0.224235 0.220785 0.246537
chargesum: 0.00000
title: Mulliken charges with hydrogens summed into heavy atoms:
elementType: Cl O O C C C C C C C C C C C C C C C C C C C C C
charge: -0.114487 -0.261856 -0.263372 -0.439208 0.417424 0.416173 0.409094 -0.045006 -0.094255 -0.125296 -0.076398 -0.125147 -0.076124 -0.121301 -0.123979 -0.138972 -0.136478 0.317991 0.316895 -0.015228 -0.016209 -0.011902 0.153534 0.154106
polarizability: 2.99340491e+02 1.72797852e-01 2.81789341e+02 -3.61529304e+00 -2.46428581e+00 1.87621408e+02
1716.lowfreq: -6.8614 -0.0388 -0.0136 -0.0031 1.2403 7.2750 24.1276 26.8810 37.1567
frequency: 23.7241 26.8723 37.1541 41.2144 61.6641 73.4386 99.9070 102.7722 132.8851 143.9965 163.7659 183.2333 197.9804 211.5452 232.2585 242.0632 243.8801 251.1348 271.8364 317.2894 320.2201 352.9934 372.3222 402.7504 410.6366 417.8431 433.3767 468.9389 492.0017 516.8028 527.7548 566.4256 572.6658 613.9328 622.0980 628.1283 645.1394 685.0913 703.5982 732.9837 739.5346 760.6158 776.0075 785.3566 812.9943 816.8572 834.0649 842.5698 856.0140 896.0240 902.8367 937.4143 946.7094 954.6471 966.8208 973.2646 982.1794 986.7217 987.4776 989.9868 997.0608 1003.2186 1004.9966 1030.2129 1087.5120 1112.6366 1112.7523 1117.9562 1119.3873 1146.7574 1157.3673 1158.3134 1173.1741 1178.2667 1184.2295 1196.1733 1231.0100 1233.2646 1236.2141 1240.9990 1301.0381 1305.6303 1321.1248 1362.9033 1371.6253 1378.7860 1418.9985 1421.5786 1432.7680 1436.7076 1436.8103 1467.1791 1467.6185 1472.4515 1473.7149 1478.8193 1496.1425 1497.3370 1572.8162 1577.1559 1585.7606 1607.0783 1617.1200 1617.9082 2960.8496 2961.6888 3049.0319 3050.3837 3125.3688 3126.2051 3126.9620 3136.2777 3145.8640 3148.5689 3148.7984 3150.4242 3151.0112 3160.3019 3166.7445 3167.9542 3169.1789 3172.4205 3172.7905
redmass: 3.9479 4.3295 4.1226 4.4819 4.6358 3.9885 3.7073 3.9633 6.3163 7.9024 3.8735 3.8900 3.2733 3.4055 2.7860 1.8776 1.3598 3.8603 8.8665 4.3587 4.5350 5.7429 5.6487 2.8563 2.9902 3.0212 4.5808 3.9710 3.7229 3.2800 2.9629 4.2767 4.4613 5.9700 5.7612 6.8354 5.8781 4.7843 1.7245 4.0368 3.1506 4.8889 3.4505 3.0993 1.3320 1.3373 1.5846 1.6946 1.2583 4.0003 4.6581 1.5697 1.4081 1.4163 1.3517 1.3631 1.3871 8.7236 8.5426 6.0582 1.3226 2.7606 2.5289 2.2116 1.6229 1.2591 1.2606 1.3479 1.3589 3.2089 1.3372 1.3287 1.0529 1.2981 1.2894 1.1182 3.0827 2.6563 3.4796 4.7293 1.2810 1.2945 1.3595 4.9268 5.6934 7.8455 3.8749 3.9778 2.2364 1.1866 1.1782 1.0503 1.0501 1.0778 1.0781 2.1798 2.3804 2.3879 7.0330 7.3060 6.0292 5.9968 6.2590 6.4131 1.0330 1.0329 1.1039 1.1039 1.0848 1.0996 1.0994 1.0887 1.0876 1.0882 1.0872 1.0906 1.0901 1.0952 1.0953 1.0953 1.1002 1.0968 1.0968
irintensity: 0.9740 0.1731 0.5742 0.2290 0.7640 2.8684 3.2325 1.2647 4.3715 4.6740 2.1248 1.0238 9.3846 0.6866 1.0322 0.9131 2.3139 0.5359 31.0971 0.7309 7.6612 3.3224 0.6983 0.3759 0.6911 0.5254 3.2849 0.2560 1.4233 5.6191 3.4177 51.6889 27.2078 5.8417 24.5102 3.3342 17.7108 38.8927 68.7830 0.7211 27.3715 20.3224 25.8038 36.8824 8.0524 13.4800 54.1090 36.4080 1.4826 15.1953 6.1989 0.0950 1.6449 1.4986 1.1852 0.5499 0.5226 54.1884 37.0427 0.2933 0.0170 6.2300 13.6349 10.0257 2.9933 0.1589 0.2077 5.4582 8.1032 14.1240 2.7411 4.3458 1.2682 207.7928 100.2414 2.4078 12.5115 24.5949 188.2672 241.2294 4.6144 1.2565 6.3478 9.1920 29.4990 1.4364 4.2424 9.7107 28.8219 8.6327 8.9306 14.5152 13.3199 57.6877 62.7815 7.2397 64.4321 97.7958 37.2196 3.9834 5.4286 0.2798 147.0751 102.8264 63.9646 78.6467 45.3630 45.0945 0.1238 28.6715 26.6019 9.2342 7.7918 4.0186 9.0957 24.0915 5.7354 19.4327 10.1430 14.0478 15.2760 6.6438 2.2029
temp: 298.150 k
press: 1.00000 atm
elementType: 17 8 8 6 6 6 6 6 6 6 6 6 6 6 6 6 6 6 6 6 6 6 6 6 1 1 1 1 1 1 1 1 1 1 1 1 1 1 1 1 1 1 1
symmnumber: 1
zpe: 887771.6 jmol-1
zpe.correction: 0.338134 hartree
zpe.thermalcorrener: 0.360223 hartree
zpe.thermalcorrenthalpy: 0.361167 hartree
zpe.thermalcorrgfe: 0.285251 hartree
zpe.sumelectzpe: -1420.418759 hartree
zpe.sumelectthermal: -1420.396670 hartree
zpe.sumelectthermalent: -1420.395726 hartree
zpe.sumelectthermalfe: -1420.471642 hartree
dipole: -0.4061 -3.3973 -2.6202
dipole: 4.3095
quadrupole: -135.9290 -118.6830 -151.4199
quadrupole: 1.4221 -10.3816 -3.1962
quadrupole: -0.5850 16.6610 -16.0759 1.4221 -10.3816 -3.1962
hfenergy: -1420.756893 hartree
pointgroup: C01 [X(C21H19Cl1O2)]
dipole: -0.2447307 -1.3110253 -1.0469173 debye
polarizability: 299.0697299|-0.5620265|281.8587934|-6.4781668|-0.7348756|187.8227162 unknown
InChI: InChI=1S/C21H19ClO2/c1-23-19-12-8-17(9-13-19)21(22,16-6-4-3-5-7-16)18-10-14-20(24-2)15-11-18/h3-15H,1-2H3
charge 0 multiplicity 1
43 atoms
Cl 0.018772 0.927175 2.718755
O  4.763206 -2.508876 -0.264026
O  -4.946943 -1.940734 -0.651644
C  0.032155 0.654202 0.692729
C  1.247441 -0.232061 0.44822
C  -1.304394 -0.011216 0.38433
C  0.160404 2.069278 0.125882
C  2.527426 0.153404 0.943787
C  -2.132423 0.440385 -0.679048
C  1.16387 -1.417779 -0.319003
C  -1.72184 -1.155893 1.110713
C  1.092449 2.363591 -0.901415
C  -0.714432 3.099807 0.564947
C  3.668312 -0.619718 0.693244
C  -3.331328 -0.222969 -1.000433
C  2.306301 -2.207915 -0.586881
C  -2.92215 -1.827523 0.80776
C  3.563631 -1.809869 -0.075487
C  -3.734415 -1.358358 -0.257549
C  1.157532 3.658385 -1.467725
C  -0.64755 4.390424 0.004175
C  0.291495 4.677487 -1.016659
C  4.708887 -3.75144 -1.038353
C  -5.411835 -3.113976 0.093237
H  2.610801 1.059454 1.552039
H  -1.836989 1.314112 -1.267405
H  0.198748 -1.732267 -0.726929
H  -1.105005 -1.506192 1.944345
H  1.765597 1.581194 -1.264344
H  -1.428858 2.883249 1.365359
H  4.648734 -0.333381 1.085497
H  -3.9685 0.123188 -1.819706
H  2.19897 -3.115049 -1.188877
H  -3.216268 -2.696057 1.404326
H  1.885924 3.865761 -2.259642
H  -1.32237 5.174627 0.365056
H  0.346695 5.682481 -1.449977
H  4.367961 -3.564723 -2.075356
H  4.044636 -4.495616 -0.557633
H  5.741954 -4.128243 -1.049718
H  -5.584465 -2.871313 1.159654
H  -4.692466 -3.95229 0.014849
H  -6.36287 -3.395948 -0.381591
