program: Gaussian 09
title: 000096786
version: EM64L-G09RevD.01
frameworkgroup: C1[X(C12H9ClN4O)]
method: RPBEPBE
basis: SDD
operation: Freq
keyword: #p
keyword: freq=noraman
keyword: PBEPBE/SDD
title: #p freq=noraman PBEPBE/SDD
converged: NO YES NO NO
title: Mulliken charges:
elementType: Cl O N N N N C C C C C C C C C C C C H H H H H H H H H
charge: 0.022976 -0.258672 -0.261001 -0.018933 -0.012608 0.063217 0.458180 0.104310 0.129615 -0.224450 -0.375472 -0.321318 -0.350505 -0.351856 0.331215 -0.308024 -0.358179 -0.537293 0.276923 0.242705 0.285642 0.248021 0.259113 0.257002 0.223745 0.251287 0.224363
chargesum: 0.00000
title: Mulliken charges with hydrogens summed into heavy atoms:
elementType: Cl O N N N N C C C C C C C C C C C C
charge: 0.022976 -0.258672 -0.261001 -0.018933 -0.012608 0.063217 0.458180 0.104310 0.129615 0.052472 -0.132767 -0.035676 -0.102484 -0.092743 0.331215 -0.308024 -0.101178 0.162102
polarizability: 2.98664998e+02 1.30199229e+00 1.64630542e+02 -1.43368022e+00 -3.26799307e+00 7.63660070e+01
1716.lowfreq: -4.1964 -1.8444 -0.0018 -0.0018 -0.0006 8.1539 28.9539 39.4516 64.3311
frequency: 28.9345 39.4411 64.3279 96.6094 127.1101 173.4145 185.1630 197.5278 227.7109 243.1876 276.8482 293.6760 347.6394 380.3429 395.0306 414.3419 476.1880 514.4493 544.6956 553.0390 557.6902 619.5371 625.5332 639.5080 653.1674 667.1947 722.5940 772.9799 787.8456 801.8349 804.2424 832.6828 842.5789 888.2605 914.2282 931.1946 960.5774 977.0089 985.4478 1009.3339 1108.2808 1111.9401 1114.6176 1148.3532 1158.6943 1168.7752 1185.1472 1230.3427 1239.6519 1271.6974 1301.7575 1308.1716 1313.7615 1366.5449 1383.5142 1398.1513 1433.0000 1435.9883 1447.3869 1468.3995 1472.1894 1496.0569 1508.4171 1558.7838 1587.1959 1627.6765 2964.2715 3053.9429 3133.1957 3145.0251 3167.7485 3171.5460 3185.9663 3190.5677 3241.1295
redmass: 4.3654 7.0319 5.8788 4.5313 6.4400 6.0373 7.2654 5.0119 1.7570 2.3353 5.1481 5.4461 5.8929 16.8890 6.0534 3.0420 4.1384 2.8331 4.6679 6.2153 6.9962 7.2594 6.9270 5.3861 6.7506 7.2478 3.7084 6.3208 6.6886 6.5991 1.4194 1.5724 1.5649 8.7669 1.4357 1.3688 1.3565 7.9339 8.5357 2.5420 4.4746 1.2662 1.7082 2.6823 1.4200 4.3713 1.2801 2.3253 3.3653 3.0106 4.0541 4.1184 1.4321 5.0400 7.3243 1.8057 2.7234 1.4190 3.6097 1.0504 1.0785 7.4857 2.8393 10.7937 7.6891 6.3429 1.0330 1.1042 1.0995 1.0889 1.0897 1.0951 1.0929 1.0968 1.0983
irintensity: 0.3309 0.3542 0.1497 2.5932 3.7725 2.4628 2.9828 1.5057 0.9241 0.7135 1.1387 1.9546 0.3321 10.5359 0.7505 0.0156 0.6366 12.0099 6.0891 19.1929 29.0991 2.5601 8.1702 13.1492 11.9456 2.8769 0.7540 1.6169 4.3184 33.0321 24.9331 82.4215 5.3328 113.2945 12.9495 0.1969 1.7303 5.7506 51.1120 33.7396 15.9114 0.3110 8.9035 19.6576 1.0816 139.4683 85.5506 180.6160 82.7885 4.0346 47.3621 165.8476 5.8042 0.9035 27.3340 57.0598 7.6166 10.6502 69.4070 15.8858 70.3486 257.5480 195.3952 95.1525 13.4927 40.0782 70.2269 45.3283 24.0071 10.7179 2.7977 7.5354 8.3138 1.0611 0.5393
temp: 298.150 k
press: 1.00000 atm
elementType: 17 8 7 7 7 7 6 6 6 6 6 6 6 6 6 6 6 6 1 1 1 1 1 1 1 1 1
symmnumber: 1
zpe: 506445.1 jmol-1
zpe.correction: 0.192895 hartree
zpe.thermalcorrener: 0.207533 hartree
zpe.thermalcorrenthalpy: 0.208477 hartree
zpe.thermalcorrgfe: 0.149668 hartree
zpe.sumelectzpe: -1215.689414 hartree
zpe.sumelectthermal: -1215.674776 hartree
zpe.sumelectthermalent: -1215.673832 hartree
zpe.sumelectthermalfe: -1215.732641 hartree
dipole: -7.3726 -1.4894 0.4243
dipole: 7.5335
quadrupole: -109.4416 -107.5195 -111.6196
quadrupole: 12.6978 -4.3010 -3.3776
quadrupole: 0.0853 2.0074 -2.0927 12.6978 -4.3010 -3.3776
hfenergy: -1215.8823091 hartree
pointgroup: C01 [X(C12H9Cl1N4O1)]
dipole: -2.9096674 0.5300818 -0.1941151 debye
polarizability: 298.6426065|1.1872686|164.4778035|2.7981146|-4.8603711|76.5411377 unknown
InChI: InChI=1S/C12H9ClN4O/c1-18-9-4-2-8(3-5-9)17-7-16-10-11(13)14-6-15-12(10)17/h2-7H,1H3
charge 0 multiplicity 1
27 atoms
Cl 5.498326 0.80567 0.006396
O  -5.070231 -0.659085 0.100625
N  0.442363 0.6247 0.121875
N  2.345271 1.933247 0.245235
N  1.533994 -1.596095 -0.180737
N  3.973279 -1.428735 -0.235231
C  -0.961707 0.308717 0.088866
C  1.532809 -0.248632 -0.01198
C  2.703851 0.589423 0.059892
C  1.003933 1.910462 0.276169
C  -1.879897 1.2582 -0.412208
C  -1.427829 -0.944715 0.563577
C  -3.263116 0.981115 -0.418285
C  -2.801464 -1.228838 0.545696
C  -3.727701 -0.268208 0.063747
C  3.930255 -0.097795 -0.063566
C  2.786759 -2.120497 -0.288307
C  -6.070496 0.291466 -0.397502
H  0.380625 2.785936 0.442094
H  -1.524655 2.20845 -0.824514
H  -0.714729 -1.691098 0.920357
H  -3.955337 1.730115 -0.812253
H  -3.18266 -2.189438 0.903475
H  2.862905 -3.201496 -0.426346
H  -6.063796 1.227416 0.193944
H  -7.035625 -0.21966 -0.273028
H  -5.905029 0.523075 -1.467389
