program: Gaussian 09
title: 000096769
version: EM64L-G09RevD.01
frameworkgroup: C1[X(C16H10O4)]
method: RPBEPBE
basis: SDD
operation: Freq
keyword: #pfreq=noraman
keyword: PBEPBE/SDD
title: #p freq=noraman PBEPBE/SDD
converged: YES YES NO NO
title: Mulliken charges:
elementType: O O O O C C C C C C C C C C C C C C C C H H H H H H H H H H
charge: -0.257248 -0.257842 -0.450498 -0.267753 0.244096 0.532137 0.229300 0.265357 -0.488811 0.062968 0.174703 -0.660386 0.174148 -0.586877 -0.383011 -0.386629 -0.202567 -0.267934 -0.255903 0.100872 0.252256 0.291337 0.274351 0.223357 0.307595 0.244042 0.243265 0.229496 0.231582 0.384598
chargesum: 0.00000
title: Mulliken charges with hydrogens summed into heavy atoms:
elementType: O O O O C C C C C C C C C C C C C C C C
charge: -0.257248 -0.257842 -0.065900 -0.267753 0.244096 0.532137 0.229300 0.265357 -0.236555 0.062968 0.174703 -0.369050 0.174148 -0.312526 -0.159654 -0.079035 0.284741 -0.038438 -0.024322 0.100872
polarizability: 3.37068806e+02 1.29362744e+01 2.18295228e+02 -1.30613989e-01 2.20569530e-02 7.39967319e+01
1716.lowfreq: -30.5028 -6.3417 -0.0008 -0.0006 0.0004 2.2216 5.0875 40.1742 58.3827
frequency: -30.4824 40.1637 58.3795 76.6986 108.9647 153.2608 198.8356 203.8748 215.2638 294.7317 297.1886 319.7698 354.7832 372.3228 406.7776 410.3810 431.0891 485.6521 531.0803 546.6080 556.1513 585.4665 606.6062 608.1492 667.2877 668.2025 684.1575 712.9004 717.7460 741.8771 749.8551 769.0406 783.2796 809.7611 821.6086 850.3430 870.3596 879.2080 895.8496 933.0850 957.0978 966.4731 972.9238 979.3153 1009.4948 1046.8123 1054.3171 1065.4062 1072.8857 1119.9012 1123.3420 1183.4575 1193.2480 1199.2090 1233.8558 1248.5421 1271.5598 1299.2693 1313.2373 1362.0355 1377.0157 1396.7017 1414.1482 1426.1544 1447.7160 1468.9780 1487.0452 1490.2036 1535.8529 1595.6886 1614.3241 1619.6827 1625.0835 1640.0493 3021.0357 3101.6510 3130.7127 3148.0335 3165.0286 3168.6346 3173.6138 3185.9532 3193.2432 3531.3044
redmass: 2.2673 12.1833 6.6707 6.1555 4.5059 7.1013 5.7473 6.7118 6.0725 9.3465 4.5480 8.5400 6.4783 8.9257 6.2506 3.2611 3.1455 5.6887 3.3633 1.7726 6.1540 7.0941 6.3616 1.8400 5.5183 6.2883 9.2558 6.5033 4.7240 2.4861 6.4521 7.1642 1.9142 1.9439 4.8705 10.2948 1.4289 1.5753 1.8861 6.5092 5.8779 1.6446 1.3736 4.8233 1.3230 2.9689 3.4045 1.4545 2.5636 1.0374 1.9820 1.1541 1.6178 1.8784 1.8701 1.7381 2.9392 1.8412 2.5657 1.3706 4.6986 2.7796 3.0404 5.9831 2.7826 2.5957 1.3200 4.2207 4.4367 8.1097 8.1048 6.0367 7.5303 8.2617 1.0536 1.1188 1.0858 1.0911 1.0974 1.0918 1.0933 1.0953 1.0910 1.0641
irintensity: 15.1013 1.2574 0.0443 0.0034 0.0531 0.1325 1.7329 1.1909 2.6670 0.2518 0.2848 1.1815 1.0187 4.5039 7.5830 0.8652 15.7711 1.1317 2.7089 45.4278 34.2804 16.0465 20.1758 109.8140 8.1830 0.7449 1.7625 1.0987 5.8974 12.8612 1.3760 15.5458 68.5525 14.6253 13.3838 29.8943 20.2774 17.7680 5.4390 114.5021 40.0875 25.7171 4.4461 168.3215 1.8045 38.0982 128.0180 4.3471 207.2003 0.0439 62.4908 14.9531 143.9940 15.9212 3.3572 89.9037 149.7437 7.8491 44.4874 2.2944 30.3162 23.3938 4.9173 20.3922 128.9706 242.1701 45.4942 37.9095 19.1473 11.6896 27.7427 3.9786 288.2728 100.7462 147.1908 27.1964 3.9639 20.7760 19.9064 0.2627 3.0524 16.7156 6.9809 59.8926
temp: 298.150 k
press: 1.00000 atm
elementType: 8 8 8 8 6 6 6 6 6 6 6 6 6 6 6 6 6 6 6 6 1 1 1 1 1 1 1 1 1 1
symmnumber: 1
zpe: 574488.6 jmol-1
zpe.correction: 0.218811 hartree
zpe.thermalcorrener: 0.233164 hartree
zpe.thermalcorrenthalpy: 0.234108 hartree
zpe.thermalcorrgfe: 0.176898 hartree
zpe.sumelectzpe: -915.243602 hartree
zpe.sumelectthermal: -915.229249 hartree
zpe.sumelectthermalent: -915.228305 hartree
zpe.sumelectthermalfe: -915.285515 hartree
dipole: -3.4435 0.1989 0.0424
dipole: 3.4495
quadrupole: -103.3302 -101.1120 -117.8609
quadrupole: -0.9811 -0.1619 -0.0117
quadrupole: 4.1042 6.3224 -10.4265 -0.9811 -0.1619 -0.0117
hfenergy: -915.4624131 hartree
pointgroup: C01 [X(C16H10O4)]
dipole: -1.3528469 -0.1029809 -0.0312192 debye
polarizability: 337.5203421|-10.68211|217.2149521|0.9276715|9.4132445|74.6254715 unknown
InChI: InChI=1S/C16H10O4/c17-16(18)13-5-9-6-14-15(20-8-19-14)7-12(9)10-3-1-2-4-11(10)13/h1-7,17H,8H2
charge 0 multiplicity 1
30 atoms
O  -4.252512 -1.111737 -0.043183
O  -4.336888 1.282375 0.119078
O  2.742728 3.296222 0.276737
O  4.303273 1.601282 0.184435
C  -0.525497 -0.545609 0.010887
C  -0.582608 0.895536 0.106667
C  0.784892 -1.198241 -0.024946
C  2.000783 -0.412125 0.035161
C  -1.754382 -1.287072 -0.04519
C  1.893218 1.044134 0.130473
C  -2.94561 -0.580356 -0.004352
C  0.635064 1.645747 0.162561
C  -2.994856 0.838447 0.090985
C  -1.841089 1.595299 0.147161
C  0.898024 -2.620981 -0.119447
C  3.262491 -1.090551 -0.001221
C  -5.172088 0.057548 0.014761
C  2.142147 -3.258984 -0.154006
C  3.333389 -2.485178 -0.094134
C  3.08766 1.928184 0.194634
H  -1.773782 -2.375166 -0.117554
H  0.576415 2.735219 0.232614
H  -1.867391 2.685454 0.220346
H  -0.00368 -3.237827 -0.165912
H  4.175435 -0.494397 0.045098
H  -5.801246 -0.027459 0.916452
H  -5.757426 0.098185 -0.919632
H  2.196358 -4.350647 -0.226504
H  4.310539 -2.979561 -0.120751
H  3.589442 3.816255 0.31678
