program: Gaussian 09
title: 000096749
version: EM64L-G09RevD.01
frameworkgroup: C1[X(C8H6BrFO)]
method: RPBEPBE
basis: SDD
operation: Freq
keyword: #p
keyword: freq=noraman
keyword: PBEPBE/SDD
title: #p freq=noraman PBEPBE/SDD
converged: YES YES NO NO
title: Mulliken charges:
elementType: Br F O C C C C C C C C H H H H H H
charge: 0.035597 -0.190865 -0.180660 0.300241 -0.302564 -0.306538 0.208712 -0.372607 -0.362427 0.334729 -0.813025 0.244097 0.286977 0.263744 0.266611 0.293941 0.294036
chargesum: 0.00000
title: Mulliken charges with hydrogens summed into heavy atoms:
elementType: Br F O C C C C C C C C
charge: 0.035597 -0.190865 -0.180660 0.300241 -0.058466 -0.019561 0.208712 -0.108863 -0.095816 0.334729 -0.225047
polarizability: 1.67567326e+02 -8.86227922e+00 9.72734779e+01 -5.40762546e-02 -9.25122635e-02 4.23113351e+01
1716.lowfreq: -11.3817 -7.9138 -3.2062 -0.0007 -0.0006 -0.0004 31.8157 67.2141 102.7422
frequency: 31.8138 67.2052 102.7408 108.0924 174.0614 269.5024 280.3143 370.2298 408.4455 432.7091 473.9604 558.1726 560.7977 623.7300 668.0065 720.7657 731.1764 807.8723 814.3936 840.8085 893.9714 954.5825 981.8166 989.8471 1004.8260 1109.5722 1131.6809 1159.7217 1191.9926 1207.4926 1264.1509 1298.1129 1379.4751 1408.1270 1412.7073 1490.0612 1583.2398 1602.2183 1621.1404 3031.6046 3107.2981 3152.4055 3160.4920 3179.8984 3182.6931
redmass: 7.0659 3.1382 8.7514 6.6036 17.4281 9.7873 6.3102 8.6025 2.9354 6.3170 3.0794 2.2750 7.5785 7.2106 6.0422 3.5973 6.8132 6.8447 1.3458 1.4151 1.9029 1.3937 4.6210 1.3483 2.5260 1.3162 1.1215 1.4183 1.8647 2.2639 2.1679 1.2810 6.0423 1.1679 3.3684 2.5391 8.1900 6.8076 8.5456 1.0567 1.1064 1.0889 1.0893 1.0962 1.0974
irintensity: 0.2287 9.0245 0.7738 0.3114 0.8008 4.1341 0.9343 1.3356 0.0044 4.0942 7.9775 12.0223 48.2678 0.6032 23.7331 0.0731 8.9652 10.7789 38.1988 66.2740 0.5457 0.7345 54.8433 0.2868 0.9943 11.8659 3.0558 86.4739 153.7029 36.6627 67.4931 11.6388 7.9287 11.1946 20.2076 40.0695 58.3005 113.3417 57.7323 22.5619 0.9764 8.3171 0.3021 2.1366 3.7491
temp: 298.150 k
press: 1.00000 atm
elementType: 35 9 8 6 6 6 6 6 6 6 6 1 1 1 1 1 1
symmnumber: 1
zpe: 308301.1 jmol-1
zpe.correction: 0.117426 hartree
zpe.thermalcorrener: 0.127489 hartree
zpe.thermalcorrenthalpy: 0.128433 hartree
zpe.thermalcorrgfe: 0.079300 hartree
zpe.sumelectzpe: -496.181721 hartree
zpe.sumelectthermal: -496.171658 hartree
zpe.sumelectthermalent: -496.170714 hartree
zpe.sumelectthermalfe: -496.219846 hartree
dipole: 2.2202 -2.7087 0.0003
dipole: 3.5023
quadrupole: -84.8381 -68.1545 -73.5838
quadrupole: 5.6638 0.0052 -0.0727
quadrupole: -9.3127 7.3710 1.9417 5.6638 0.0052 -0.0727
hfenergy: -496.2991469 hartree
pointgroup: C01 [X(C8H6Br1F1O1)]
dipole: 0.9360214 1.0111668 -0.0061946 debye
dipolederiv: -0.4453936 0.0387819 0.0000828 -0.02215 -0.046295 -0.0001381 0.0012769 -0.0004639 -0.0920498 -1.2791721 -0.0942383 -0.0022141 -0.0992552 -0.2156195 0.0004187 -0.0023231 0.0004251 -0.146348 -0.7655237 -0.1042202 -0.0008118 -0.2865116 -0.7283963 0.0005698 0.0006176 0.0014272 -0.2845987 -0.8426566 -0.0404085 -0.0018823 0.1303614 -0.1780563 0.0006838 -0.0023291 0.0005458 -0.0270929 0.2630588 -0.0060936 0.0011249 0.1383052 0.0770679 -0.0015903 0.0011315 -0.001829 -0.1213951 0.1517984 0.0762266 0.0001186 -0.1654772 0.0681196 -0.0019519 0.0010219 -0.0010758 -0.0810767 1.5473361 0.0676966 0.0038685 -0.2662173 0.8722567 -0.0018292 0.0061608 -0.0032997 0.1307086 -0.4208546 0.0449504 -0.0012216 0.3112253 -0.0260646 -0.000496 -0.0040231 -0.0012638 -0.1548813 -0.2900561 -0.1331405 0.0010295 -0.2963439 -0.0931531 -0.0016559 0.0025085 -0.0010443 -0.1588286 1.4369547 0.0995172 0.0027766 0.0680179 0.369195 -0.0023001 0.0032132 -0.0022347 0.1171197 0.5566678 0.1253705 -0.0026098 0.4544754 -0.2653639 0.0025503 -0.0073295 0.0033845 0.0874397 0.0541164 0.0927514 -0.0013266 0.116643 -0.0088072 0.0017246 -0.0015844 0.0017401 0.1439723 0.124979 -0.062633 0.0005914 -0.0152341 0.0331769 0.0012644 0.0004088 0.000883 0.1548137 0.056933 -0.0493753 0.0001403 -0.0633477 -0.0002926 0.001672 0.0002753 0.0017378 0.1828166 0.0265149 0.0611637 -0.001037 0.0664808 0.0283595 0.0017489 -0.0010789 0.0017958 0.1829615 -0.0878854 -0.0591946 -0.0740995 -0.0363203 0.055776 -0.0571775 -0.0549454 -0.0578736 0.0344453 -0.0868169 -0.0571543 0.07547 -0.034652 0.0580972 0.0565066 0.056999 0.0571455 0.0319938 unknown
polarizability: 168.3771268|4.5777866|96.4596685|0.1338851|-0.46331|42.3153435 unknown
InChI: InChI=1S/C8H6BrFO/c9-5-8(11)6-1-3-7(10)4-2-6/h1-4H,5H2
charge 0 multiplicity 1
17 atoms
Br -4.552201 0.546189 -0.007631
F  3.952649 0.271399 0.003124
O  -2.211852 -1.49754 -0.004692
C  -0.232187 -0.12266 -0.005258
C  0.369622 1.166481 -0.016144
C  0.601475 -1.276413 0.008357
C  -1.721288 -0.339096 -0.00781
C  1.772011 1.306091 -0.013643
C  2.002476 -1.156522 0.011447
C  2.555511 0.138201 0.000267
C  -2.591217 0.92752 -0.016088
H  -0.243224 2.073433 -0.026988
H  0.120687 -2.2596 0.016328
H  2.254821 2.287109 -0.022172
H  2.65759 -2.03197 0.02216
H  -2.395714 1.544302 0.876819
H  -2.400459 1.527176 -0.921879
