program: Gaussian 09
title: 000096743
version: EM64L-G09RevD.01
frameworkgroup: C1[X(C7H6BrF)]
method: RPBEPBE
basis: SDD
operation: Freq
keyword: #p
keyword: freq=noraman
keyword: PBEPBE/SDD
title: #p freq=noraman PBEPBE/SDD
converged: NO YES NO YES
title: Mulliken charges:
elementType: Br F C C C C C C C H H H H H H
charge: 0.006815 -0.204344 0.575799 -0.384458 -0.549625 -0.806699 -0.131386 0.351238 -0.383629 0.266419 0.255320 0.255319 0.230240 0.254537 0.264453
chargesum: 0.00000
title: Mulliken charges with hydrogens summed into heavy atoms:
elementType: Br F C C C C C C C
charge: 0.006815 -0.204344 0.575799 -0.384458 -0.283206 -0.065820 0.123151 0.351238 -0.119175
polarizability: 1.28536595e+02 2.05414280e+00 9.26150547e+01 -1.42302473e-03 -2.36673506e-04 3.88705076e+01
1716.lowfreq: -7.3462 -7.1728 -0.0008 -0.0007 -0.0005 8.7548 99.3493 132.9121 193.4493
frequency: 99.3421 132.9095 193.4492 204.6653 254.5369 306.8768 313.2616 442.1471 454.2189 529.8604 557.9225 562.1525 696.7985 710.2264 806.2163 869.1643 926.3327 937.0067 997.2616 1010.0675 1045.9568 1114.4704 1150.4158 1228.6216 1264.9404 1365.7731 1396.4517 1403.7249 1450.9814 1460.7750 1476.8424 1582.7031 1609.3405 2985.1474 3063.4065 3099.2951 3163.4014 3165.3979 3186.4163
redmass: 8.1641 1.0404 5.8924 3.1406 9.4983 5.5817 7.0174 2.9015 3.7038 5.4638 3.4914 7.8788 3.4290 6.6114 1.3410 1.4362 3.7865 1.3372 2.2672 2.6665 1.5259 1.3631 1.7155 2.5390 1.6070 7.6375 3.4339 1.2326 2.5215 1.0441 1.2097 6.2780 8.0435 1.0373 1.0971 1.0996 1.0920 1.0899 1.0977
irintensity: 0.9054 0.5716 0.8675 1.8776 1.4266 0.8237 4.3612 9.5501 2.0811 0.8927 5.0627 34.6790 0.5697 0.0763 37.0930 36.0579 6.7323 0.2475 6.5567 85.0192 11.4503 13.2726 36.3275 20.1249 13.7880 1.9551 16.8672 24.6084 49.3871 14.0255 76.5810 13.2232 21.1636 14.6207 11.2307 18.6278 3.6729 0.3854 1.6269
temp: 298.150 k
press: 1.00000 atm
elementType: 35 9 6 6 6 6 6 6 6 1 1 1 1 1 1
symmnumber: 1
zpe: 282429.2 jmol-1
zpe.correction: 0.107572 hartree
zpe.thermalcorrener: 0.116012 hartree
zpe.thermalcorrenthalpy: 0.116957 hartree
zpe.thermalcorrgfe: 0.073194 hartree
zpe.sumelectzpe: -382.998122 hartree
zpe.sumelectthermal: -382.989681 hartree
zpe.sumelectthermalent: -382.988737 hartree
zpe.sumelectthermalfe: -383.032500 hartree
dipole: 0.4767 0.5816 0.0000
dipole: 0.7520
quadrupole: -69.8379 -51.9357 -64.0224
quadrupole: 0.7518 0.0001 -0.0001
quadrupole: -7.9059 9.9963 -2.0904 0.7518 0.0001 -0.0001
hfenergy: -383.1056936 hartree
pointgroup: C01 [X(C7H6Br1F1)]
dipole: -0.223562 -0.1937631 0.0000032 debye
dipolederiv: -0.6269631 0.1348808 -0.0000107 0.1387862 -0.0955536 0.0000029 -0.0000099 0.0000023 -0.0346473 -1.1665973 0.1454539 -0.0000139 0.1849365 -0.2429701 0.0000022 -0.0000176 0.0000022 -0.1527157 -0.0799569 0.2774509 -0.0000044 0.196507 0.2076022 0.0000013 -0.0000085 -0.0000024 0.0372721 1.0662422 -0.323487 0.0000227 -0.3486077 -0.0935956 -0.0000057 0.000022 -0.000005 -0.1699919 -0.2478025 -0.0950901 -0.0000009 -0.0856804 -0.0854799 -0.0000004 -0.0000008 0.0000022 -0.1792925 -0.0818106 -0.1601727 -0.0000006 -0.1177545 0.0065653 -0.000001 0.0000032 0.0000057 0.042484 -0.183403 0.0493741 -0.0000031 0.0712123 0.0566778 0.0000027 -0.0000019 0.0000016 -0.0781008 1.2737047 -0.153427 0.000016 -0.2085983 0.3372259 -0.0000021 0.0000202 -0.000002 0.1126063 -0.1919382 0.0204673 0.0000002 0.1205122 -0.1025094 0.0000022 0.0000003 0.0000006 -0.1767519 0.0607626 0.0349403 -0.0000017 0.0518545 -0.0275653 0. -0.0000009 -0.0000013 0.1790696 0.0303932 -0.0399656 0.0928099 -0.0178644 0.0598397 -0.0314483 0.1013128 0.0118235 -0.0214079 0.0303906 -0.0399631 -0.092812 -0.0178602 0.0598419 0.0314512 -0.1013146 -0.011823 -0.0214055 0.023503 0.1560083 0.0000025 0.0522282 -0.0869725 -0.0000028 0.0000003 -0.0000026 0.1123909 0.0797505 0.0509393 -0.0000011 0.0412667 -0.0255905 -0.0000003 -0.0000016 0.0000001 0.1594582 0.0137247 -0.0574093 -0.0000029 -0.060938 0.032484 -0.0000018 -0.000003 -0.0000019 0.1910324 unknown
polarizability: 128.1927227|-4.0563112|92.9589265|0.0014426|-0.0000076|38.8705076 unknown
InChI: InChI=1S/C7H6BrF/c1-5-4-6(9)2-3-7(5)8/h2-4H,1H3
charge 0 multiplicity 1
15 atoms
Br -3.003769 0.911187 -0.000058
F  3.020506 -0.282504 0.000038
C  -0.654471 -0.862048 -0.000019
C  -1.079713 0.494223 -0.000024
C  0.746082 -1.094442 0.000004
C  -1.622576 -2.026197 -0.000024
C  -0.174897 1.576079 -0.000003
C  1.638828 -0.010861 0.000016
C  1.215707 1.327613 0.000017
H  1.135198 -2.117274 0.000005
H  -2.283193 -1.995248 0.88606
H  -2.283207 -1.99523 -0.8861
H  -1.084523 -2.988189 -0.000041
H  -0.547042 2.6041 -0.000003
H  1.943071 2.14359 0.000033
