program: Gaussian 09
title: 000096753
version: EM64L-G09RevD.01
frameworkgroup: C1[X(C13H12N2S)]
method: RPBEPBE
basis: SDD
operation: Freq
keyword: #p
keyword: freq=noraman
keyword: PBEPBE/SDD
title: #p freq=noraman PBEPBE/SDD
converged: YES YES NO NO
title: Mulliken charges:
elementType: S N N C C C C C C C C C C C C C H H H H H H H H H H H H
charge: 0.207527 -0.047813 -0.044083 0.315209 -0.122289 -0.342901 -0.352947 -0.200947 -0.226360 -0.227192 -0.230202 -0.150976 -0.293929 -0.739413 0.031576 -0.556425 0.278732 0.256147 0.228635 0.227880 0.229813 0.250414 0.250452 0.264631 0.311944 0.241868 0.222216 0.218433
chargesum: 0.00000
title: Mulliken charges with hydrogens summed into heavy atoms:
elementType: S N N C C C C C C C C C C C C C
charge: 0.207527 -0.047813 -0.044083 0.315209 -0.122289 -0.064169 -0.096800 -0.200947 0.002275 0.000688 -0.000389 0.099438 -0.043477 -0.162838 0.273444 -0.115776
polarizability: 2.64720083e+02 4.26335486e+00 2.12788327e+02 7.18881872e+00 7.82557904e+00 7.95049432e+01
1716.lowfreq: -6.6891 -6.2211 0.0011 0.0019 0.0021 3.0472 16.2797 26.5822 45.4848
frequency: 15.9650 26.2331 45.4805 75.4905 95.0351 109.3842 157.6880 182.3979 221.7512 261.3765 287.0935 325.2473 382.4828 404.4377 413.1937 415.1566 477.4516 490.9827 563.9417 614.6826 627.3929 635.2835 681.4082 700.2598 705.6119 759.0615 789.7313 811.8342 834.2837 863.5687 884.7887 937.7493 941.8197 947.7971 953.2178 970.3162 990.0076 996.2609 1005.8480 1009.0762 1019.8115 1061.8732 1073.7308 1085.4207 1105.5889 1144.7177 1171.4859 1178.4955 1217.3680 1243.9139 1246.9402 1271.5541 1292.4860 1312.0838 1357.5454 1387.9396 1398.1929 1419.9685 1439.3169 1448.0722 1486.9221 1502.8534 1517.2762 1588.0810 1612.0212 1650.7173 2998.3511 3090.9379 3101.8132 3119.8304 3126.8582 3139.5704 3139.8122 3155.1833 3168.8007 3175.0322 3178.5499 3202.6418
redmass: 3.6562 3.9919 5.5812 2.7390 4.4543 4.0908 7.6516 3.7854 5.2379 3.2145 4.7004 4.8328 6.6107 2.8611 3.1889 2.6904 3.7200 6.4819 2.4099 6.4573 4.8786 7.2400 8.0278 1.7786 2.2673 2.3715 6.9006 2.2529 1.6732 1.2480 1.4177 7.3343 2.2510 1.3503 1.4484 1.4111 6.2297 1.3737 1.1465 1.3342 2.5689 2.3052 2.1572 1.5820 1.5239 3.2359 1.0566 1.1236 1.3451 1.9629 2.1138 2.2404 1.2157 1.4074 2.9246 5.6865 2.5839 1.1464 2.3042 1.1435 2.7618 6.4419 5.2201 6.4308 6.2112 4.5041 1.0626 1.0610 1.0986 1.0966 1.0852 1.0901 1.0900 1.0945 1.0945 1.0986 1.0971 1.1145
irintensity: 0.0085 0.2238 0.0935 0.6779 5.6637 0.5252 0.5893 4.6011 1.1120 3.5817 0.4052 3.7387 9.5118 0.0575 2.6748 1.4624 0.0554 0.0506 16.7123 0.1395 9.2396 12.0353 34.2600 51.1786 29.6804 47.6982 39.5431 29.5486 16.6842 0.0967 10.2459 1.0659 4.5172 74.3810 4.3953 0.0496 0.7840 0.0559 9.2535 0.7161 11.5838 11.0844 15.1532 24.1313 2.3458 97.4403 0.3540 18.7102 9.9361 3.8730 15.1663 14.5032 0.9994 3.2142 42.0342 79.6539 283.3705 6.0817 1.6325 21.0902 17.8957 138.1838 406.0762 0.5941 6.0842 11.4969 45.1153 9.3380 3.2550 11.5105 0.0694 6.1736 32.6441 27.9826 12.3368 16.8389 6.7516 23.3039
temp: 298.150 k
press: 1.00000 atm
elementType: 16 7 7 6 6 6 6 6 6 6 6 6 6 6 6 6 1 1 1 1 1 1 1 1 1 1 1 1
symmnumber: 1
zpe: 564891.9 jmol-1
zpe.correction: 0.215156 hartree
zpe.thermalcorrener: 0.229724 hartree
zpe.thermalcorrenthalpy: 0.230668 hartree
zpe.thermalcorrgfe: 0.170507 hartree
zpe.sumelectzpe: -1008.997746 hartree
zpe.sumelectthermal: -1008.983178 hartree
zpe.sumelectthermalent: -1008.982233 hartree
zpe.sumelectthermalfe: -1009.042395 hartree
dipole: -0.3988 -0.6298 -0.0513
dipole: 0.7472
quadrupole: -94.5303 -88.4229 -103.8806
quadrupole: -0.9191 1.0616 1.7791
quadrupole: 1.0810 7.1883 -8.2693 -0.9191 1.0616 1.7791
hfenergy: -1009.2129015 hartree
pointgroup: C01 [X(C13H12N2S1)]
dipole: -0.1637328 0.2419645 0.0327773 debye
polarizability: 262.7365118|-1.7946718|212.5504229|-21.5219002|7.701628|81.7264189 unknown
InChI: InChI=1S/C13H12N2S/c1-2-10-16-12-8-9-14-13(15-12)11-6-4-3-5-7-11/h2-9H,1,10H2
charge 0 multiplicity 1
28 atoms
S  -3.307063 -0.873438 0.624295
N  -0.599042 -0.472207 0.217199
N  1.011428 -2.218638 -0.28659
C  1.762712 0.106115 -0.107013
C  0.677903 -0.906835 -0.056287
C  3.096736 -0.297129 -0.386005
C  1.484294 1.480643 0.120618
C  -1.592366 -1.389201 0.263304
C  4.131447 0.659016 -0.435818
C  2.521719 2.434049 0.070233
C  3.848742 2.02731 -0.208002
C  -1.344003 -2.770529 0.03783
C  -0.009256 -3.125518 -0.234099
C  -3.098712 1.021975 0.815663
C  -3.776465 1.757739 -0.303624
C  -4.826138 2.602982 -0.136127
H  3.292126 -1.359464 -0.558653
H  0.454176 1.780408 0.333635
H  5.15732 0.340612 -0.651628
H  2.299018 3.492193 0.246797
H  4.654247 2.769386 -0.247056
H  -2.141429 -3.516565 0.072845
H  0.264754 -4.169927 -0.418778
H  -3.511224 1.27618 1.804025
H  -2.000892 1.154315 0.806126
H  -3.363632 1.588334 -1.30771
H  -5.271413 3.136542 -0.982678
H  -5.265686 2.786652 0.852297
