program: Gaussian 09
title: 000096781
version: EM64L-G09RevD.01
frameworkgroup: C1[X(C14H18N4O)]
method: RPBEPBE
basis: SDD
operation: Freq
keyword: #p
keyword: freq=noraman
keyword: PBEPBE/SDD
title: #p freq=noraman PBEPBE/SDD
converged: YES YES NO NO
title: Mulliken charges:
elementType: O N N N N C C C C C C C C C C C C C C H H H H H H H H H H H H H H H H H H
charge: -0.280720 -0.039421 -0.446541 -0.480589 -0.030092 -0.400034 -0.401096 -0.369400 -0.380043 -0.392424 -0.350836 0.310862 0.491712 -0.440584 -0.328340 -0.353500 -0.371886 0.403033 -0.262030 0.186532 0.203713 0.201405 0.198055 0.255470 0.189047 0.206219 0.196577 0.205146 0.217122 0.224115 0.206734 0.291853 0.290812 0.223974 0.313801 0.255794 0.255559
chargesum: 0.00000
title: Mulliken charges with hydrogens summed into heavy atoms:
elementType: O N N N N C C C C C C C C C C C C C C
charge: -0.280720 -0.039421 -0.154688 -0.189778 -0.030092 -0.009789 -0.001637 0.075117 0.022754 0.029845 0.080013 0.310862 0.491712 -0.216610 -0.014539 -0.097706 -0.116327 0.403033 -0.262030
polarizability: 3.06497606e+02 1.63705053e+01 1.65270380e+02 -3.05116955e+00 -4.35164346e+00 1.10944917e+02
1716.lowfreq: -0.0011 -0.0008 -0.0006 2.1202 6.8893 17.1729 32.1575 33.6801 40.8604
frequency: 29.7654 32.6449 40.8151 67.0019 78.7978 101.5377 122.7731 135.2622 171.3459 185.4104 223.4057 258.2241 260.3829 294.3238 309.2532 336.9372 357.4473 371.4636 407.1644 412.0780 447.3835 460.6357 474.4940 484.8224 538.9287 547.1338 559.1732 596.4042 637.0804 678.6823 710.4338 735.1235 735.4213 752.5085 803.7119 804.9215 829.9009 839.4275 850.9408 859.4752 869.8625 947.3632 957.7117 960.3784 975.4487 984.3418 997.1591 1004.8311 1009.6181 1063.1028 1099.2116 1119.3001 1125.0868 1138.4182 1144.4440 1179.6034 1189.7374 1205.5406 1208.2347 1216.3475 1248.7748 1266.7679 1278.3157 1282.8893 1308.2104 1310.7538 1336.5793 1343.2556 1349.8121 1354.4459 1357.5152 1362.5717 1375.7166 1424.6493 1449.6101 1456.9761 1460.6492 1461.1697 1468.0856 1475.6242 1488.0381 1495.4202 1509.7324 1578.0639 1621.8275 1645.9369 2172.1745 2934.7372 2954.2302 2954.6529 2965.7126 2979.5165 2981.1619 3011.6172 3017.7945 3026.9589 3039.3609 3054.7221 3056.9516 3118.8730 3157.0843 3164.7287 3197.3372 3477.8187 3518.4231
redmass: 3.8416 4.9681 4.2033 4.7128 4.9654 5.9922 5.4089 5.1610 2.0735 4.6386 6.3002 1.9690 4.5439 4.3381 2.5566 5.2764 1.3361 2.3937 3.0008 4.5745 3.3096 3.3729 2.8498 2.0451 3.3908 6.2338 3.0355 1.2427 7.3502 3.4551 7.8978 4.1280 4.2760 6.4175 2.8702 1.5676 1.4097 2.8045 2.3048 1.8691 1.4635 2.1064 1.3738 2.2284 3.6830 1.8485 1.3245 2.8835 2.3187 2.1345 2.4353 2.5474 1.3800 1.6826 1.9384 1.9839 1.3321 1.2690 2.2169 1.8579 1.5446 1.2232 2.0460 1.2978 1.3478 1.5088 1.3936 1.4464 1.4112 3.1896 1.5664 1.3405 1.3361 4.1427 1.3527 1.0900 1.0847 1.0850 1.0920 1.0904 2.0677 1.0887 3.0126 4.7431 5.5635 4.7221 12.6270 1.0659 1.0688 1.0620 1.0621 1.0637 1.0656 1.0962 1.0960 1.0989 1.1013 1.0957 1.0974 1.0895 1.0916 1.0957 1.0951 1.0778 1.0756
irintensity: 0.3520 0.0517 0.6189 1.2635 3.0173 9.3884 0.0080 5.7012 0.4203 4.6093 9.3042 2.0358 0.4251 5.5392 1.6348 2.4369 20.9085 1.6775 0.1483 8.3504 5.9655 3.2833 18.4003 12.0090 0.3473 0.5859 44.3556 117.6557 1.8421 1.7575 4.2952 0.0291 0.2455 1.4242 5.0636 1.6852 42.7270 9.3505 4.7394 1.7853 63.8869 32.9948 0.0655 2.9822 2.6237 1.7298 1.0602 0.5773 1.4239 5.2463 32.8201 63.2742 12.9803 26.7791 28.0621 11.5472 59.5435 4.6582 19.7230 183.9629 74.1873 5.5809 22.9544 4.8389 69.0848 15.4642 3.4245 5.4026 41.7240 143.8555 9.8767 0.2137 8.7708 23.9275 135.3650 22.8474 7.7252 2.8344 13.3971 16.8513 203.4118 31.7224 506.4086 80.6801 151.4958 127.7703 92.4592 39.3085 54.5771 40.2720 29.7514 25.0088 36.0353 81.6161 27.2906 81.1544 54.7049 29.2083 37.5338 16.5326 5.0375 4.5050 8.7616 53.5682 13.8834
temp: 298.150 k
press: 1.00000 atm
elementType: 8 7 7 7 7 6 6 6 6 6 6 6 6 6 6 6 6 6 6 1 1 1 1 1 1 1 1 1 1 1 1 1 1 1 1 1 1
symmnumber: 1
zpe: 798110.3 jmol-1
zpe.correction: 0.303984 hartree
zpe.thermalcorrener: 0.321880 hartree
zpe.thermalcorrenthalpy: 0.322824 hartree
zpe.thermalcorrgfe: 0.256780 hartree
zpe.sumelectzpe: -837.082622 hartree
zpe.sumelectthermal: -837.064726 hartree
zpe.sumelectthermalent: -837.063782 hartree
zpe.sumelectthermalfe: -837.129826 hartree
dipole: 5.9645 4.8884 -0.5668
dipole: 7.7326
quadrupole: -156.4960 -102.2049 -113.4644
quadrupole: -15.9371 3.0094 -1.0380
quadrupole: -32.4409 21.8502 10.5907 -15.9371 3.0094 -1.0380
hfenergy: -837.3866059 hartree
pointgroup: C01 [X(C14H18N4O1)]
dipole: 2.3101578 -1.9730706 0.1595357 debye
polarizability: 305.8251622|-19.2619378|166.1107097|0.0677281|-3.2352257|110.7770308 unknown
InChI: InChI=1S/C14H18N4O/c15-11-12-5-7-13(8-6-12)16-14(19)17-18-9-3-1-2-4-10-18/h5-8,16-17H,1-4,9-10H2
charge 0 multiplicity 1
37 atoms
O  0.90985 0.567011 0.011095
N  3.156021 -1.235553 0.188132
N  1.790713 -1.593933 0.2679
N  -0.530965 -1.306933 0.185107
N  -6.868081 1.392813 -0.082381
C  5.33897 1.320406 0.533718
C  5.418163 0.97404 -0.969953
C  3.971408 1.02923 1.195646
C  5.052169 -0.487993 -1.326875
C  3.676778 -0.482548 1.375201
C  3.54991 -0.823139 -1.191448
C  0.735803 -0.679138 0.141363
C  -1.804201 -0.69627 0.124616
C  -2.944301 -1.54755 0.202946
C  -1.992179 0.708754 -0.009616
C  -4.241458 -1.016292 0.149667
C  -3.294543 1.233883 -0.061588
C  -4.435398 0.38732 0.016482
C  -5.762275 0.936407 -0.03772
H  6.124442 0.75649 1.080885
H  5.582377 2.394461 0.659136
H  4.744083 1.649836 -1.53543
H  6.446106 1.184326 -1.32791
H  3.141977 1.500669 0.637272
H  3.972393 1.481123 2.208208
H  5.648714 -1.201423 -0.723851
H  5.330713 -0.664653 -2.384247
H  4.607954 -0.981171 1.717644
H  2.925371 -0.624436 2.171876
H  2.949396 0.046832 -1.538441
H  3.304805 -1.679057 -1.84935
H  1.604621 -2.593493 0.387742
H  -0.542057 -2.325894 0.273133
H  -2.810865 -2.63192 0.306255
H  -1.119061 1.359838 -0.071632
H  -5.109535 -1.679798 0.21074
H  -3.43542 2.314555 -0.164424
