program: Gaussian 09
title: 000096763
version: EM64L-G09RevD.01
frameworkgroup: C1[X(C19H16N2O2)]
method: RPBEPBE
basis: SDD
operation: Freq
keyword: #p
keyword: freq=noraman
keyword: PBEPBE/SDD
title: #p freq=noraman PBEPBE/SDD
converged: YES YES NO NO
title: Mulliken charges:
elementType: O O N N C C C C C C C C C C C C C C C C C C C H H H H H H H H H H H H H H H H
charge: -0.324463 -0.324541 -0.345801 -0.344135 0.371161 0.395073 0.299646 -0.548657 -0.435203 -0.358122 -0.407230 -0.406296 0.187826 0.285280 -0.238771 -0.235363 0.452065 -0.504476 0.195215 -0.351350 -0.384078 -0.228294 -0.803433 0.283769 0.240692 0.211135 0.246513 0.241775 0.231994 0.231178 0.279011 0.212960 0.355894 0.236231 0.355460 0.230839 0.239235 0.232866 0.224395
chargesum: 0.00000
title: Mulliken charges with hydrogens summed into heavy atoms:
elementType: O O N N C C C C C C C C C C C C C C C C C C C
charge: -0.324463 -0.324541 0.010093 0.011324 0.371161 0.395073 0.299646 -0.264888 -0.194511 -0.146987 -0.160717 -0.164521 0.187826 0.285280 -0.006777 -0.004184 0.452065 -0.225465 0.195215 -0.138390 -0.147846 0.002545 -0.106938
polarizability: 4.82761788e+02 -1.29912614e+01 2.28785563e+02 1.95099368e-01 -5.54428257e-02 9.09647324e+01
1716.lowfreq: -6.3087 -0.0010 -0.0008 -0.0002 3.4803 5.1375 11.2380 17.9755 27.0427
frequency: 6.7069 17.5116 27.0064 28.1499 32.8464 88.4402 108.6365 112.6341 152.2632 164.0229 177.9081 201.4514 202.1613 233.9305 298.9013 308.3133 334.9878 357.2531 381.8442 394.1027 428.2259 463.4957 479.9410 495.8978 501.8915 510.7876 514.1943 533.3921 586.6607 595.2353 618.6287 631.7751 640.8997 663.3170 688.4551 709.5862 712.0586 758.8000 760.6405 767.5917 791.3386 801.8143 811.6201 822.6564 879.0699 882.2967 898.3249 930.6218 946.8325 947.9676 958.2067 963.3111 979.4202 984.2542 988.2287 995.3833 996.8656 1022.2314 1052.0793 1062.3028 1099.0794 1105.4108 1133.4430 1169.8875 1174.4392 1178.6426 1189.1637 1202.4100 1232.6516 1238.1546 1265.7056 1275.5094 1296.0095 1315.2982 1354.0476 1385.8443 1398.6422 1399.2523 1413.2232 1424.6582 1433.6625 1438.0459 1467.9927 1469.3602 1473.6556 1484.6693 1506.9933 1528.0343 1532.6024 1564.7213 1584.8353 1602.4780 1604.4230 1618.5516 1640.4218 2978.6068 3060.7396 3089.5932 3123.1030 3123.4572 3124.2142 3130.5220 3131.6935 3145.0242 3146.1706 3146.6566 3148.7258 3158.6063 3164.6333 3495.2537 3509.6627
redmass: 3.7460 6.8156 5.9498 1.0535 4.9484 5.4985 8.8210 6.0443 5.1964 5.9982 3.6197 3.3569 4.5212 5.2212 6.3042 5.5645 6.6927 3.5930 6.4946 3.1030 3.0405 4.9296 2.6265 3.5987 3.8601 5.2530 6.7254 5.6212 6.6845 1.6821 1.1551 6.7993 2.1628 6.9093 3.0223 2.3069 2.0773 5.9877 5.8754 1.5030 2.6709 1.8065 6.2282 1.4650 4.8432 1.5556 1.3417 4.3318 1.3962 1.3915 3.4688 1.4877 1.4454 1.3666 4.5841 1.6767 1.3566 2.3128 1.5795 2.7825 1.9380 1.7192 1.6724 1.2928 1.2332 1.9584 1.1606 1.4353 2.6988 1.9488 1.8337 1.7128 1.8329 1.6512 1.8948 7.2765 1.8887 1.5681 5.2777 2.8338 3.1439 3.8631 2.0695 1.7819 1.0589 1.6905 4.1514 5.6816 2.6851 5.9694 7.1989 5.6507 5.5302 6.3992 6.8826 1.0386 1.0952 1.1000 1.0861 1.0863 1.0860 1.0887 1.0917 1.0941 1.0917 1.0946 1.0956 1.0991 1.1005 1.0786 1.0792
irintensity: 0.0624 0.1162 1.0414 0.8236 1.5873 0.3129 9.3333 0.3444 0.1875 0.3218 0.9792 10.2396 23.4333 1.3695 0.0613 1.0541 0.0443 19.7137 10.1671 0.0043 2.6274 1.5426 13.8795 20.7993 1.9566 12.9678 6.5558 30.9445 1.2357 7.6399 127.0626 2.3886 16.8888 3.1782 0.1695 41.7534 60.2561 11.4424 5.8619 62.7516 0.0365 40.3679 0.6383 60.1998 5.8859 11.3649 0.0922 6.2910 6.7020 5.3329 1.9756 3.3863 15.4958 0.1593 0.1718 4.6502 0.2069 3.3348 18.7537 0.3478 17.2144 12.1789 4.4423 4.7442 1.4000 1.1328 0.7270 48.3249 6.6324 1.2382 6.9899 9.9187 3.1129 0.1128 42.5974 5.2809 395.6226 393.0730 36.4618 8.7222 157.0745 228.6070 43.0274 133.9431 19.0661 87.3508 99.4050 214.9080 21.1727 11.1709 6.5843 1.7346 11.7368 3.5793 7.3753 33.7906 21.2912 16.1523 0.0564 3.2917 7.3760 0.1304 30.1673 4.2287 3.2684 31.9766 12.9124 22.8249 40.3887 1.1856 181.8659
temp: 298.150 k
press: 1.00000 atm
elementType: 8 8 7 7 6 6 6 6 6 6 6 6 6 6 6 6 6 6 6 6 6 6 6 1 1 1 1 1 1 1 1 1 1 1 1 1 1 1 1
symmnumber: 1
zpe: 797215.1 jmol-1
zpe.correction: 0.303643 hartree
zpe.thermalcorrener: 0.323504 hartree
zpe.thermalcorrenthalpy: 0.324448 hartree
zpe.thermalcorrgfe: 0.250531 hartree
zpe.sumelectzpe: -992.006616 hartree
zpe.sumelectthermal: -991.986756 hartree
zpe.sumelectthermalent: -991.985811 hartree
zpe.sumelectthermalfe: -992.059729 hartree
dipole: 0.0272 -0.2088 0.0705
dipole: 0.2221
quadrupole: -87.0157 -128.0278 -141.6005
quadrupole: 8.5743 0.5670 -0.1112
quadrupole: 31.8656 -9.1464 -22.7192 8.5743 0.5670 -0.1112
hfenergy: -992.3102596 hartree
pointgroup: C01 [X(C19H16N2O2)]
dipole: 0.0105262 -0.0820541 0.0281243 debye
polarizability: 482.7414433|-12.9328938|228.777599|3.1837941|-0.6970067|90.9930412 unknown
InChI: InChI=1S/C19H16N2O2/c1-13-5-4-8-16(11-13)18(22)20-21-19(23)17-10-9-14-6-2-3-7-15(14)12-17/h2-12,20-21H,1H3
charge 0 multiplicity 1
39 atoms
O  -0.469884 1.9357 0.065557
O  2.4670 -1.807671 0.075521
N  0.35544 -0.204074 0.062337
N  1.643247 0.331749 0.07245
C  -4.51196 0.531045 0.040347
C  -4.77128 -0.895332 0.024261
C  -2.084224 0.092196 0.046398
C  -3.159178 0.990975 0.051079
C  -3.655336 -1.797434 0.019207
C  -2.345919 -1.322659 0.029886
C  -5.622123 1.440324 0.045002
C  -6.127531 -1.357163 0.013535
C  -0.709911 0.676954 0.058499
C  4.08549 0.033173 0.086909
C  -6.933985 0.961695 0.03426
C  -7.188581 -0.447668 0.018451
C  6.509468 -0.440819 0.126067
C  5.166163 -0.883413 0.116215
C  2.7083 -0.54924 0.07765
C  4.352679 1.427954 0.061909
C  6.756538 0.956631 0.097359
C  5.687729 1.881057 0.067092
C  7.655742 -1.434765 0.188141
H  -2.936161 2.063772 0.063122
H  -3.84683 -2.876724 0.006346
H  -1.525934 -2.049687 0.024045
H  -5.423518 2.518375 0.05712
H  -6.321951 -2.436186 0.00137
H  -7.776089 1.662087 0.037855
H  -8.222774 -0.808953 0.010229
H  4.925155 -1.952285 0.129825
H  3.546412 2.170002 0.032238
H  0.353689 -1.229171 0.061034
H  7.790633 1.322044 0.096933
H  1.646221 1.356815 0.078704
H  5.896712 2.95602 0.042646
H  7.92821 -1.658047 1.237924
H  7.38657 -2.392026 -0.290795
H  8.55997 -1.042848 -0.309727
