program: Gaussian 09
title: 000096760
version: EM64L-G09RevD.01
frameworkgroup: C1[X(C19H16N2O2)]
method: RPBEPBE
basis: SDD
operation: Freq
keyword: #p
keyword: freq=noraman
keyword: PBEPBE/SDD
title: #p freq=noraman PBEPBE/SDD
converged: YES YES NO NO
title: Mulliken charges:
elementType: O O N N C C C C C C C C C C C C C C C C C C C H H H H H H H H H H H H H H H H
charge: -0.321533 -0.311294 -0.348349 -0.328654 0.371059 0.394912 0.299284 -0.549341 -0.434853 -0.359686 -0.407143 -0.406174 0.170750 0.322232 0.188269 -0.238696 -0.235282 0.155332 -0.369818 -0.403960 -0.785312 -0.248128 -0.219240 0.283795 0.240665 0.211791 0.246583 0.241765 0.232120 0.231263 0.246601 0.235463 0.354443 0.264954 0.234046 0.211989 0.362648 0.235239 0.232258
chargesum: 0.00000
title: Mulliken charges with hydrogens summed into heavy atoms:
elementType: O O N N C C C C C C C C C C C C C C C C C C C
charge: -0.321533 -0.311294 0.006095 0.033994 0.371059 0.394912 0.299284 -0.265546 -0.194189 -0.147894 -0.160560 -0.164409 0.170750 0.322232 0.188269 -0.006576 -0.004019 0.155332 -0.123217 -0.168497 -0.074323 -0.012889 0.013018
polarizability: 4.56436133e+02 4.12500957e+00 2.23157680e+02 -2.20320166e+00 -4.67689856e+00 1.06802980e+02
1716.lowfreq: -4.5738 -2.8122 -0.0007 0.0004 0.0007 4.4494 13.0815 26.6158 34.7947
frequency: 12.3517 26.5481 34.7712 40.4931 88.3703 96.7560 108.6485 127.7001 151.6592 164.4921 178.4307 191.9567 226.1466 250.1216 307.3645 312.7936 334.2389 361.6448 377.3473 394.9015 421.9793 461.7783 480.3451 494.6254 499.5770 512.8950 530.9497 552.7497 582.6935 588.6023 608.5981 631.6037 635.6266 656.4081 689.9085 710.4400 739.7448 759.6888 763.0472 767.9184 781.4139 791.4420 793.5319 823.0893 851.4069 878.4765 882.4012 918.6134 948.1621 953.7889 956.4357 963.5844 979.8118 994.2789 994.9477 997.1265 1022.3997 1038.1952 1048.1150 1052.2662 1085.6158 1130.4790 1139.7030 1169.4163 1175.5756 1178.9443 1190.5490 1206.0388 1222.0098 1234.9506 1252.0578 1275.0756 1284.9989 1296.4029 1353.8814 1371.1660 1400.3910 1405.9528 1414.4061 1422.6078 1424.4903 1436.3080 1456.0884 1467.0941 1472.1533 1484.1538 1507.0149 1522.1856 1531.0159 1566.1989 1582.7244 1589.1505 1604.2940 1612.8782 1640.1343 2992.4340 3077.6926 3093.9431 3122.7937 3124.1833 3124.3762 3129.7523 3130.5409 3144.6317 3145.3735 3146.6811 3148.1979 3164.7693 3165.7446 3491.6826 3505.9153
redmass: 4.7557 5.3784 6.0609 5.5190 5.2973 5.8480 7.9310 1.2047 3.0183 5.8969 3.5997 4.6704 4.1795 4.9882 7.7376 5.4242 6.4436 4.9028 4.7542 3.1257 3.5395 3.3101 2.6599 3.6841 3.9617 6.7596 4.7825 5.4892 1.8060 3.4319 1.1371 6.5157 2.8152 5.9807 3.8484 2.4721 1.7745 4.8036 5.7271 1.5575 2.0014 2.6851 5.5182 1.4608 6.0048 1.3066 1.5550 5.1366 1.3976 3.6854 1.4380 1.4804 1.4431 1.3395 1.5928 1.3562 2.3329 3.3588 1.6508 2.1845 2.3837 1.7141 1.6218 1.3043 1.1254 1.0718 2.1223 2.2815 2.0643 2.2332 1.6760 1.7360 1.5065 2.1506 1.8973 6.3825 2.9420 1.3045 5.1192 1.8916 2.7916 4.4562 1.0787 2.5339 1.2173 2.4368 3.8438 2.6131 6.9025 6.1509 6.9778 6.6721 5.5400 6.2524 6.8476 1.0366 1.0965 1.1008 1.0864 1.0859 1.0858 1.0894 1.0889 1.0944 1.0939 1.0950 1.0950 1.1005 1.1008 1.0791 1.0791
irintensity: 0.0833 0.8183 1.9221 0.0920 0.8375 1.5977 7.7731 1.0825 1.7178 2.1775 0.9761 9.0617 21.6175 2.6655 3.2670 0.2496 0.0974 14.7281 6.6739 0.1959 10.7538 6.2959 16.8571 12.5567 9.8272 0.7885 23.1504 8.8652 13.9521 13.5218 165.1857 2.3793 1.1271 13.2239 13.5405 7.4524 40.6110 0.6444 8.2070 59.0732 40.9179 0.2416 3.2024 60.2545 0.4543 0.6828 11.0939 0.0845 6.5465 10.0822 0.2412 3.2601 15.1303 0.0396 0.3886 0.2109 4.3054 6.2004 12.1458 6.6849 5.2122 9.3677 2.9987 5.2503 1.2807 1.5956 26.9384 2.9552 19.3735 5.1701 3.2196 12.1042 7.6492 9.4675 46.1678 40.1638 878.3957 71.8520 135.3102 27.1615 24.1970 18.1346 20.3589 80.8780 63.8090 75.3411 74.5563 6.0081 224.4115 1.8689 21.6612 9.2161 11.2988 16.8385 6.6957 21.5490 16.5394 27.6925 6.0382 4.8230 9.1235 2.8742 0.1251 4.1118 29.9274 35.6838 9.4908 41.4453 26.9615 3.6203 183.2460
temp: 298.150 k
press: 1.00000 atm
elementType: 8 8 7 7 6 6 6 6 6 6 6 6 6 6 6 6 6 6 6 6 6 6 6 1 1 1 1 1 1 1 1 1 1 1 1 1 1 1 1
symmnumber: 1
zpe: 797671.3 jmol-1
zpe.correction: 0.303817 hartree
zpe.thermalcorrener: 0.323390 hartree
zpe.thermalcorrenthalpy: 0.324334 hartree
zpe.thermalcorrgfe: 0.253236 hartree
zpe.sumelectzpe: -992.003334 hartree
zpe.sumelectthermal: -991.983762 hartree
zpe.sumelectthermalent: -991.982818 hartree
zpe.sumelectthermalfe: -992.053915 hartree
dipole: -0.6241 0.3007 0.1681
dipole: 0.7129
quadrupole: -94.7066 -130.0738 -138.9254
quadrupole: -9.0761 2.9767 1.3655
quadrupole: 26.5287 -8.8385 -17.6902 -9.0761 2.9767 1.3655
hfenergy: -992.3071514 hartree
pointgroup: C01 [X(C19H16N2O2)]
dipole: -0.2508479 -0.0410983 -0.1185441 debye
polarizability: 455.7148714|0.5993968|171.4515526|-15.3085863|58.0182869|159.2303697 unknown
InChI: InChI=1S/C19H16N2O2/c1-13-6-2-5-9-17(13)19(23)21-20-18(22)16-11-10-14-7-3-4-8-15(14)12-16/h2-12,20-21H,1H3
charge 0 multiplicity 1
39 atoms
O  -0.296052 1.620439 1.130503
O  2.489075 -1.529505 -1.114965
N  0.444833 -0.205647 -0.045188
N  1.754937 0.225525 0.16958
C  -4.389424 0.547158 0.481864
C  -4.700433 -0.705519 -0.178323
C  -1.979187 0.082591 0.233261
C  -3.020648 0.910548 0.67277
C  -3.618119 -1.540625 -0.614583
C  -2.292207 -1.162157 -0.417047
C  -5.465896 1.386927 0.923909
C  -6.072686 -1.070053 -0.370839
C  4.166567 -0.026597 -0.092136
C  5.218699 -0.173029 -1.050959
C  -0.583685 0.557265 0.4772
C  -6.794343 1.006355 0.722339
C  -7.100029 -0.231448 0.069923
C  2.78375 -0.510706 -0.397289
C  4.435961 0.552234 1.1789
C  6.508056 0.29676 -0.69358
C  5.002429 -0.793779 -2.418827
C  5.727529 1.006546 1.511759
C  6.769102 0.880694 0.56568
H  -2.758826 1.851062 1.170488
H  -3.848695 -2.492001 -1.107956
H  -1.498862 -1.838254 -0.755691
H  -5.228455 2.3337 1.422937
H  -6.30654 -2.017904 -0.869949
H  -7.610338 1.652939 1.062587
H  -8.14665 -0.517419 -0.081475
H  3.638449 0.612135 1.928791
H  7.321169 0.200388 -1.422455
H  0.396022 -1.048264 -0.626965
H  4.756521 -1.865971 -2.331002
H  4.149802 -0.333589 -2.949391
H  5.9063 -0.680847 -3.041637
H  1.813265 1.114978 0.677462
H  5.919985 1.442164 2.497728
H  7.779326 1.228805 0.807878
