program: Gaussian 09
title: 000010745
version: EM64L-G09RevD.01
frameworkgroup: C1[X(C16H12O6)]
method: RPBEPBE
basis: SDD
operation: Freq
keyword: #pfreq=noraman
keyword: PBEPBE/SDD
title: #p freq=noraman PBEPBE/SDD
converged: YES YES NO NO
title: Mulliken charges:
elementType: O O O O O O C C C C C C C C C C C C C C C C H H H H H H H H H H H H
charge: -0.322969 -0.301594 -0.208386 -0.442620 -0.240458 -0.195341 0.170138 0.281876 0.305208 0.148315 -0.299594 0.170530 -0.346064 -0.356143 -0.241397 -0.311128 -0.199703 -0.200012 -0.231257 0.134219 0.268925 -0.751595 0.273812 0.253462 0.260011 0.235033 0.282259 0.235308 0.237789 0.237726 0.244770 0.240808 0.278736 0.389337
chargesum: 0.00000
title: Mulliken charges with hydrogens summed into heavy atoms:
elementType: O O O O O O C C C C C C C C C C C C C C C C
charge: -0.322969 -0.301594 -0.208386 -0.053283 -0.240458 -0.195341 0.170138 0.281876 0.305208 0.148315 -0.025782 0.170530 -0.092602 -0.096132 -0.006364 -0.028869 0.035605 0.037777 0.006469 0.134219 0.268925 0.012718
polarizability: 2.52655490e+02 -2.49826695e+01 1.73697167e+02 1.98076398e+01 1.09582209e+00 1.58863102e+02
1716.lowfreq: -1.5546 -0.0008 -0.0006 0.0005 3.1646 5.3459 15.6227 31.5251 39.1146
frequency: 15.5819 31.5152 39.1091 46.1178 66.0848 79.3943 85.3367 101.9180 116.0705 125.0992 134.8169 175.1620 218.1979 231.9105 259.6348 284.5169 303.0009 339.6353 393.2825 405.6744 423.0593 430.4650 456.5487 491.2450 500.7940 523.1146 534.3359 537.1231 583.7973 589.2787 604.8284 635.0335 648.3001 667.4826 683.9960 710.0926 713.8481 741.7306 769.9411 781.8901 785.7405 797.0833 823.2412 866.4438 886.5367 891.2072 965.5406 969.0006 973.3364 988.3462 996.8977 1000.5904 1002.2737 1035.6944 1037.8467 1039.3658 1104.4534 1109.9913 1148.7198 1158.3902 1171.9257 1175.2236 1180.6009 1193.1862 1234.5653 1268.3602 1272.4522 1318.8465 1377.5760 1383.4633 1386.4031 1431.4865 1433.7250 1450.4178 1455.8849 1467.8393 1475.6750 1577.3010 1579.4499 1610.2851 1612.1006 1642.3686 1657.2227 1698.2701 3009.6130 3103.9140 3140.3459 3141.4662 3142.4505 3158.8551 3159.4082 3174.7104 3175.2758 3186.8666 3190.9001 3530.7309
redmass: 6.5978 7.5829 6.1905 8.3251 5.1639 4.5949 4.9781 6.3521 1.0787 5.6287 5.9360 6.1592 6.8510 7.7859 5.8829 7.5970 3.7127 8.3405 9.0910 5.4229 3.2268 4.5723 5.2030 4.4363 4.3371 4.5677 5.2341 3.5635 4.4030 1.3919 5.5912 5.1739 5.7237 4.8738 3.8928 4.8839 4.2184 3.8413 3.1466 2.4261 1.6338 2.5308 5.9071 5.4771 1.5978 1.5180 1.4533 4.5409 1.4779 2.2583 1.3515 1.3536 5.3802 2.1275 2.1805 1.6780 2.0332 2.1586 2.8255 1.5569 1.2911 1.1888 1.9254 2.9274 3.1433 1.4836 1.5152 2.5578 1.2404 10.9641 11.1962 2.2627 2.2882 1.0565 1.0527 2.5977 2.7503 6.7766 6.8854 7.0166 7.0378 8.6373 12.2659 10.7418 1.0364 1.0962 1.0867 1.0867 1.1022 1.0921 1.0919 1.0971 1.0963 1.0973 1.0963 1.0642
irintensity: 0.3833 1.2424 0.7501 0.6534 2.5920 5.7587 3.5725 0.9237 0.1351 1.2076 0.3830 0.5633 1.3923 0.9699 0.5479 0.6422 2.4692 2.2040 6.8722 2.8199 10.1010 2.2765 13.2052 4.1439 7.2858 19.9782 8.4608 8.5219 13.3160 89.6624 26.4921 11.7788 19.5813 22.8529 54.3650 11.1611 1.4188 40.2386 1.8127 31.0367 51.1261 48.6765 32.7207 89.9524 11.4250 2.6138 31.4984 433.8692 56.6847 112.3035 1.0156 2.2192 194.3382 8.9453 27.7521 7.4902 85.8376 93.4805 389.2237 93.7476 113.5567 11.3317 148.2651 25.4537 152.7895 19.6435 15.7276 74.7105 76.1232 3.9403 3.6721 11.7162 18.7700 14.1248 19.4894 74.7670 43.0477 14.4633 24.0991 29.4608 34.8455 379.8597 222.3723 167.9312 1.9246 6.5248 2.9821 3.6105 10.1105 17.7893 16.0193 12.1026 5.5638 7.8862 4.6952 51.7165
temp: 298.150 k
press: 1.00000 atm
elementType: 8 8 8 8 8 8 6 6 6 6 6 6 6 6 6 6 6 6 6 6 6 6 1 1 1 1 1 1 1 1 1 1 1 1
symmnumber: 1
zpe: 641370.8 jmol-1
zpe.correction: 0.244285 hartree
zpe.thermalcorrener: 0.264157 hartree
zpe.thermalcorrenthalpy: 0.265101 hartree
zpe.thermalcorrgfe: 0.193195 hartree
zpe.sumelectzpe: -1066.709426 hartree
zpe.sumelectthermal: -1066.689554 hartree
zpe.sumelectthermalent: -1066.688610 hartree
zpe.sumelectthermalfe: -1066.760517 hartree
dipole: -1.6229 -1.4323 -1.7356
dipole: 2.7744
quadrupole: -100.7015 -116.1917 -119.4772
quadrupole: -5.4178 -1.0302 -2.4484
quadrupole: 11.4220 -4.0682 -7.3537 -5.4178 -1.0302 -2.4484
hfenergy: -1066.9537117 hartree
pointgroup: C01 [X(C16H12O6)]
dipole: -0.5936866 -0.8134867 -0.4210092 debye
polarizability: 256.4815266|-10.2730997|170.5676419|24.1792916|-1.6168183|158.1665902 unknown
InChI: InChI=1S/C16H12O6/c1-10(17)21-14-9-5-3-7-12(14)16(20)22-13-8-4-2-6-11(13)15(18)19/h2-9,18H,1H3
charge 0 multiplicity 1
34 atoms
O  -0.698623 -1.193258 -0.121422
O  2.772897 0.954472 -1.366809
O  0.00873 0.910412 -0.869374
O  -2.895886 1.678144 2.315782
O  -0.890233 0.546489 2.0801
O  2.538113 2.664671 0.226995
C  1.623017 -0.663787 0.107057
C  2.820137 -0.063826 -0.377294
C  -2.06735 -0.864666 -0.292947
C  -2.749998 0.058675 0.55105
C  1.730891 -1.737168 1.030789
C  0.292378 -0.178195 -0.33408
C  4.08254 -0.527946 0.035477
C  -2.751407 -1.560313 -1.308882
C  2.991399 -2.198369 1.455933
C  -4.136647 0.27551 0.323699
C  4.169541 -1.595748 0.954241
C  -4.130396 -1.339711 -1.507756
C  -4.823931 -0.412842 -0.693865
C  -2.061644 0.743574 1.677151
C  2.49901 2.304378 -0.958347
C  2.184805 3.130869 -2.176785
H  0.81073 -2.185511 1.412154
H  4.97854 -0.045951 -0.366402
H  -2.188549 -2.26121 -1.932127
H  3.057602 -3.019687 2.176504
H  -4.658116 0.988069 0.967573
H  5.152868 -1.951076 1.280532
H  -4.657312 -1.883243 -2.299203
H  -5.892154 -0.232731 -0.850412
H  2.846332 2.863869 -3.016458
H  2.270354 4.201241 -1.939362
H  1.146099 2.903865 -2.477088
H  -2.378539 2.104099 3.050875
