program: Gaussian 09
title: 000096755
version: EM64L-G09RevD.01
frameworkgroup: C1[X(C14H16ClN3O3)]
method: RPBEPBE
basis: SDD
operation: Freq
keyword: #p
keyword: freq=noraman
keyword: PBEPBE/SDD
title: #p freq=noraman PBEPBE/SDD
converged: YES YES NO NO
title: Mulliken charges:
elementType: Cl O O O N N N C C C C C C C C C C C C C C H H H H H H H H H H H H H H H H
charge: -0.089771 -0.433558 -0.255991 -0.258774 -0.216013 -0.204845 -0.363024 -0.511968 -0.379684 0.365575 -0.631205 -0.055014 -0.443121 0.378993 0.234058 0.260082 -0.090759 -0.403327 -0.791927 -0.267482 -0.136123 0.295866 0.221319 0.274816 0.261017 0.214036 0.268957 0.256582 0.258208 0.257918 0.211175 0.237662 0.240945 0.354485 0.262018 0.258741 0.420131
chargesum: 0.00000
title: Mulliken charges with hydrogens summed into heavy atoms:
elementType: Cl O O O N N N C C C C C C C C C C C C C C
charge: -0.089771 -0.013427 -0.255991 -0.258774 -0.216013 -0.204845 -0.008539 0.005217 0.156149 0.365575 0.108371 -0.055014 -0.184913 0.378993 0.234058 0.260082 -0.090759 -0.145409 -0.102145 -0.005464 0.122618
polarizability: 2.29461232e+02 -2.37350442e+01 1.85212283e+02 -1.12909346e+01 7.69990830e+00 1.51755406e+02
1716.lowfreq: -2.9224 -1.4682 -0.0012 0.0006 0.0011 7.4193 12.2457 26.3990 31.1477
frequency: 12.0048 26.3849 31.1437 74.2362 80.9966 84.0363 97.9559 119.7066 147.9114 174.0932 179.2685 196.7091 232.5276 234.1552 245.4624 265.3102 299.1863 328.6686 345.6113 358.6151 375.0651 388.7444 421.7653 438.4147 480.3844 491.4405 505.7069 522.7382 543.7704 550.6017 556.2164 559.0906 636.1189 650.8168 698.7440 706.4623 711.0548 741.8516 748.4729 802.4148 820.8902 851.9929 856.7793 868.7998 874.6334 904.3936 947.9881 962.7286 969.1722 1008.8655 1022.5657 1045.9674 1052.6463 1057.0426 1092.6030 1099.1977 1101.8601 1137.0548 1148.8836 1177.7644 1216.0736 1220.1569 1228.1398 1242.1453 1267.4253 1295.7881 1324.1087 1341.8654 1362.4255 1372.7756 1374.5927 1398.0417 1401.4736 1415.2260 1429.4837 1439.7625 1448.7520 1452.8425 1459.6799 1467.3692 1478.2196 1480.3411 1485.6365 1517.5422 1587.4639 1595.0915 1625.5397 1643.3402 1666.5619 2514.1680 2945.2079 2948.9996 2982.2548 3019.9156 3036.5963 3060.1814 3063.1991 3092.5074 3109.6173 3113.9097 3146.7009 3154.8883 3179.4607 3221.1024 3562.1641
redmass: 6.9999 5.5322 8.2946 1.8836 1.7565 4.2508 3.9109 9.3800 6.5389 5.1836 3.8154 5.6693 1.8689 3.3258 1.5998 3.3309 4.2370 3.4344 7.0136 6.1801 5.2791 3.4648 4.7636 3.0365 4.4944 3.8629 3.3160 7.5235 4.6958 5.1409 3.6844 5.0541 1.5056 5.0039 3.1870 3.3939 4.7014 4.8844 6.0682 1.8079 4.2265 5.4713 6.9197 1.4842 1.3463 2.4046 1.2910 2.6680 1.9987 2.2916 2.1518 1.5205 2.5639 2.4607 1.4471 3.3866 1.6255 2.0321 1.3080 1.9319 3.4605 1.7939 1.4043 2.2690 1.9747 1.9460 1.7016 1.9121 4.1065 1.5959 1.4348 1.2842 1.4249 3.0269 1.1777 2.3905 2.1396 1.0463 1.2082 1.1089 1.1351 1.1418 1.0549 1.7004 6.5087 5.8887 3.4362 7.3858 5.8492 1.0698 1.0613 1.0471 1.0364 1.0986 1.0614 1.0966 1.0876 1.1004 1.1033 1.1032 1.0925 1.0926 1.0922 1.0981 1.0787
irintensity: 0.5281 0.5524 1.5319 1.9227 4.8563 9.1357 2.2377 0.3924 1.4778 0.3955 5.7975 0.4404 0.2514 1.2488 0.6109 7.0071 14.8763 0.8608 1.8125 13.7938 13.3303 11.5276 20.9916 0.6797 5.9911 2.3828 3.7649 6.4810 3.3945 14.6675 5.4447 12.6446 42.2133 37.1774 26.4622 23.9644 54.5162 8.9226 8.5343 29.3806 79.5469 5.7887 41.0205 28.9541 17.5742 20.7694 0.0209 9.4939 59.3689 72.8058 7.1089 6.0051 5.1015 6.1421 10.5759 21.2040 9.6211 39.8006 70.6462 27.7939 98.0623 23.4129 53.9146 10.3183 3.8061 10.2142 94.9697 72.6613 17.4955 9.5422 5.0926 23.9762 36.6787 10.3299 21.6476 112.3443 13.9277 14.2331 41.1110 13.0553 46.5242 35.0127 19.2155 80.2339 180.9856 8.1301 37.1690 450.4329 214.0575 1303.8320 22.1218 73.7417 28.0682 5.7714 14.5756 16.4668 16.0951 20.4436 4.6936 6.4484 3.2732 3.2318 4.4715 1.9057 97.3823
temp: 298.150 k
press: 1.00000 atm
elementType: 17 8 8 8 7 7 7 6 6 6 6 6 6 6 6 6 6 6 6 6 6 1 1 1 1 1 1 1 1 1 1 1 1 1 1 1 1
symmnumber: 1
zpe: 750384.1 jmol-1
zpe.correction: 0.285806 hartree
zpe.thermalcorrener: 0.305753 hartree
zpe.thermalcorrenthalpy: 0.306697 hartree
zpe.thermalcorrgfe: 0.235055 hartree
zpe.sumelectzpe: -1391.562526 hartree
zpe.sumelectthermal: -1391.542579 hartree
zpe.sumelectthermalent: -1391.541635 hartree
zpe.sumelectthermalfe: -1391.613277 hartree
dipole: -6.6153 1.2557 0.5866
dipole: 6.7590
quadrupole: -124.3210 -117.9428 -137.6441
quadrupole: -10.0879 8.5794 -10.1169
quadrupole: 2.3149 8.6932 -11.0081 -10.0879 8.5794 -10.1169
hfenergy: -1391.8483319 hartree
pointgroup: C01 [X(C14H16Cl1N3O3)]
dipole: 2.5476561 0.1737657 -0.7419403 debye
polarizability: 224.7417414|7.6791945|163.004235|-29.2449846|-18.0374381|178.6829454 unknown
InChI: InChI=1S/C14H16ClN3O3/c1-9-5-11(15)6-10(13(9)20)7-17(2)8-18-12(19)3-4-16-14(18)21/h3-6,16,20H,7-8H2,1-2H3
charge 0 multiplicity 1
37 atoms
Cl -5.838227 0.131938 1.58443
O  -0.467963 0.757931 -1.071135
O  2.837533 -1.061502 -1.923065
O  2.204475 0.35038 2.524884
N  0.322407 -1.413319 0.100671
N  2.541329 -0.37638 0.313075
N  3.782986 0.951516 -1.209597
C  -0.632132 -1.020507 1.200686
C  1.720892 -1.591525 0.563061
C  -1.852781 -0.293185 0.652167
C  -0.173996 -2.533816 -0.745827
C  -1.702363 0.618539 -0.437274
C  -3.119725 -0.445859 1.259744
C  -2.799553 1.397853 -0.902777
C  3.034709 -0.224425 -1.000617
C  2.727514 0.567896 1.392764
C  -4.19673 0.325346 0.792237
C  -4.053971 1.241064 -0.268415
C  -2.597712 2.361939 -2.051384
C  3.533442 1.735649 1.048952
C  4.020295 1.89852 -0.22353
H  -0.068346 -0.350982 1.879075
H  -0.940629 -1.909753 1.791351
H  1.774705 -1.783499 1.648565
H  2.182119 -2.417947 0.001589
H  -0.233767 -3.491289 -0.185814
H  0.498959 -2.651536 -1.610985
H  -1.183035 -2.283193 -1.113313
H  -3.256005 -1.145666 2.09098
H  -4.913139 1.827318 -0.60923
H  -3.545871 2.84547 -2.341707
H  -1.868376 3.148677 -1.782848
H  -2.176725 1.841037 -2.930662
H  4.122777 1.078198 -2.164748
H  3.709435 2.476418 1.828607
H  4.608166 2.769968 -0.5221
H  0.099501 -0.066974 -0.741708
