program: Gaussian 09
title: 000096742
version: EM64L-G09RevD.01
frameworkgroup: C1[X(C18H13BrN2O2)]
method: RPBEPBE
basis: SDD
operation: Freq
keyword: #p
keyword: freq=noraman
keyword: PBEPBE/SDD
title: #p freq=noraman PBEPBE/SDD
converged: YES YES NO NO
title: Mulliken charges:
elementType: Br O O N N C C C C C C C C C C C C C C C C C C H H H H H H H H H H H H H
charge: 0.029250 -0.321288 -0.316830 -0.330068 -0.346354 0.190211 0.399693 0.192551 -0.364979 -0.432131 -0.401745 -0.424816 -0.253223 0.159449 -0.247906 -0.240083 0.288398 0.201686 -0.336411 -0.327129 -0.181147 -0.192560 -0.205463 0.292081 0.243561 0.249240 0.239037 0.235736 0.231441 0.231424 0.364830 0.354795 0.284040 0.220839 0.257308 0.256565
chargesum: 0.00000
title: Mulliken charges with hydrogens summed into heavy atoms:
elementType: Br O O N N C C C C C C C C C C C C C C C C C C
charge: 0.029250 -0.321288 -0.316830 0.034763 0.008441 0.190211 0.399693 0.192551 -0.072898 -0.188570 -0.152505 -0.185779 -0.017487 0.159449 -0.016465 -0.008659 0.288398 0.201686 -0.052372 -0.106290 0.076161 0.064004 -0.205463
polarizability: 4.50045483e+02 6.61797301e+00 2.40982305e+02 -5.13874366e+00 4.07710782e+00 1.05889750e+02
1716.lowfreq: -5.1480 -0.0005 -0.0002 -0.0001 1.4045 4.1722 8.5920 19.5944 28.9858
frequency: 8.4632 19.5461 28.9346 35.2231 76.1364 82.7220 106.8623 122.9119 146.5367 178.9885 182.0663 203.6003 241.6434 261.3362 285.4255 310.8349 327.9718 358.9949 400.9306 404.4180 424.9800 459.7657 472.4361 474.3176 488.2457 508.4180 526.1375 572.9420 594.6514 609.0179 622.0562 636.4305 652.1086 672.9815 691.4936 716.6360 734.6968 752.1278 760.8729 787.6767 792.1210 821.5772 823.4472 831.3821 855.9828 887.3118 910.8192 930.9001 954.4391 970.6991 990.7748 993.7986 994.5762 997.0899 1000.2206 1030.7175 1054.6943 1066.9428 1083.4541 1114.6778 1128.1029 1156.3918 1176.5794 1188.2143 1196.3022 1213.7406 1236.7306 1244.4922 1271.2686 1287.4012 1306.0896 1363.4582 1369.7214 1392.9656 1400.2007 1409.3496 1414.4209 1440.3363 1454.9314 1474.9402 1515.9706 1516.6594 1528.2091 1556.7819 1584.5794 1590.1685 1596.1498 1598.8063 1631.0813 3124.4088 3127.2445 3134.9701 3135.8589 3139.0142 3157.7057 3159.4682 3162.9310 3172.7861 3177.7449 3181.2270 3487.4960 3506.8088
redmass: 3.9246 7.5649 8.4454 7.5067 6.7206 7.2188 9.3709 6.1209 8.6901 6.3902 4.4403 5.1961 7.4218 7.2673 7.0702 6.9946 6.3395 6.6375 2.9627 3.6321 4.7907 5.6096 3.2797 3.7992 5.2803 4.5573 6.7732 4.2078 1.4224 1.1091 6.7175 3.5401 6.4424 3.6202 6.8656 3.1796 3.2720 1.5193 6.3564 4.0488 2.0780 1.6309 1.4205 6.0209 1.4638 1.6702 5.5822 1.4353 1.3827 1.3714 1.4065 1.6845 2.8821 4.2749 1.3495 2.4362 4.3525 2.2830 2.2530 1.4105 2.1074 1.4102 1.1212 1.2984 1.2458 2.5805 1.7632 1.6915 1.7297 1.8590 1.4857 3.2416 3.2157 4.0504 3.1521 2.6137 6.2473 2.4258 2.5039 2.4407 4.9035 3.8569 3.4106 6.4909 7.2537 6.9755 5.8595 5.5610 6.5862 1.0867 1.0865 1.0916 1.0895 1.0906 1.0888 1.0975 1.0989 1.0955 1.0972 1.0960 1.0789 1.0795
irintensity: 0.0067 0.2286 0.8700 0.0571 0.7512 0.1994 9.6161 2.8451 1.0054 8.7297 3.5070 12.4329 1.5254 0.9233 23.9076 0.4361 18.9065 3.4000 0.3689 2.6475 4.3527 4.0904 1.6466 13.1592 22.4804 19.1559 3.3242 14.3151 1.1071 198.1753 3.0935 2.0371 7.6875 16.1485 9.8429 0.0193 25.3523 1.8299 15.3692 12.1134 71.4305 65.7374 14.6786 8.9416 36.5165 2.9759 1.1710 1.5173 0.2605 1.9804 3.9085 21.9922 50.1688 6.9024 0.5820 14.2213 17.3886 22.4365 6.2184 29.2467 10.4935 1.1179 7.6972 9.5324 9.6452 1.4472 6.1990 2.6622 10.2408 5.8586 3.3841 188.3568 111.7885 53.2805 157.4227 761.3298 1.8653 38.2456 66.1740 39.0495 179.1247 65.1017 114.0927 3.0779 16.9147 29.1828 61.2606 23.1570 2.7108 1.0149 0.2887 15.9306 12.0307 21.9641 0.4440 32.3229 21.2876 4.3429 2.9899 15.4268 30.9568 159.1232
temp: 298.150 k
press: 1.00000 atm
elementType: 35 8 8 7 7 6 6 6 6 6 6 6 6 6 6 6 6 6 6 6 6 6 6 1 1 1 1 1 1 1 1 1 1 1 1 1
symmnumber: 1
zpe: 699569.4 jmol-1
zpe.correction: 0.266452 hartree
zpe.thermalcorrener: 0.285889 hartree
zpe.thermalcorrenthalpy: 0.286833 hartree
zpe.thermalcorrgfe: 0.214057 hartree
zpe.sumelectzpe: -965.561403 hartree
zpe.sumelectthermal: -965.541966 hartree
zpe.sumelectthermalent: -965.541022 hartree
zpe.sumelectthermalfe: -965.613798 hartree
dipole: -2.2338 0.1846 0.1504
dipole: 2.2464
quadrupole: -121.2012 -136.1424 -148.2863
quadrupole: -5.4745 -3.7180 -3.3221
quadrupole: 14.0087 -0.9324 -13.0763 -5.4745 -3.7180 -3.3221
hfenergy: -965.8278549 hartree
pointgroup: C01 [X(C18H13Br1N2O2)]
dipole: -0.8766712 -0.0107794 0.1115898 debye
polarizability: 449.3776386|16.1479386|169.6570361|-6.1815054|67.2148876|177.882863 unknown
InChI: InChI=1S/C18H13BrN2O2/c19-14-10-8-13(9-11-14)17(22)20-21-18(23)16-7-3-5-12-4-1-2-6-15(12)16/h1-11,20-21H
charge 0 multiplicity 1
36 atoms
Br 8.302229 -0.322778 -0.745711
O  -0.708213 -0.41652 -1.556818
O  2.023478 1.058331 2.052891
N  -0.014437 0.491772 0.429883
N  1.302094 0.280839 0.0166
C  -3.529449 -0.442568 -0.313459
C  -4.848159 -0.101201 0.190766
C  -2.417658 0.419149 0.035194
C  -3.392066 -1.62525 -1.116502
C  -5.022972 1.072375 0.994491
C  -2.639575 1.567638 0.817206
C  -5.964165 -0.946337 -0.12206
C  -3.939348 1.896531 1.299176
C  -1.029991 0.124793 -0.440954
C  -4.500005 -2.428078 -1.40007
C  -5.797261 -2.090661 -0.902024
C  3.722886 0.358867 0.438804
C  2.318948 0.593211 0.897736
C  4.752415 0.579332 1.388742
C  4.071842 -0.059172 -0.87263
C  6.105626 0.381528 1.048903
C  5.422079 -0.261143 -1.227489
C  6.425019 -0.040259 -0.259176
H  -2.409905 -1.872595 -1.525697
H  -6.026989 1.317251 1.360703
H  -1.810982 2.252445 1.030963
H  -6.953517 -0.675846 0.265652
H  -4.079194 2.801769 1.898597
H  -4.37542 -3.324581 -2.017231
H  -6.654516 -2.731143 -1.136029
H  -0.094325 0.825343 1.39629
H  1.355991 -0.142369 -0.91637
H  4.467074 0.908123 2.392975
H  3.31217 -0.224144 -1.645033
H  6.894482 0.551833 1.786589
H  5.687113 -0.581083 -2.238911
