program: Gaussian 09
title: 000096706
version: EM64L-G09RevD.01
frameworkgroup: C1[X(C4H4N2O2)]
method: RPBEPBE
basis: SDD
operation: Freq
keyword: #pfreq=noraman
keyword: PBEPBE/SDD
title: #p freq=noraman PBEPBE/SDD
converged: NO YES YES YES
title: Mulliken charges:
elementType: O O N N C C C C H H H H
charge: -0.212045 -0.254742 -0.367341 0.041189 0.338678 -0.312022 -0.179184 -0.222434 0.355053 0.284711 0.268311 0.259827
chargesum: 0.00000
title: Mulliken charges with hydrogens summed into heavy atoms:
elementType: O O N N C C C C
charge: -0.212045 -0.254742 -0.012288 0.041189 0.338678 -0.027311 0.089126 0.037393
polarizability: 1.02171103e+02 8.60051482e-01 7.21041303e+01 1.88380039e-04 -6.57137000e-04 2.53361772e+01
1716.lowfreq: -10.4230 -5.2515 -0.0006 -0.0005 0.0008 5.4557 111.9616 190.7729 211.3368
frequency: 111.9612 190.7725 211.3359 426.7134 518.0686 585.7958 598.0257 680.9946 698.6604 732.3221 746.5578 842.8977 872.5620 901.0143 940.5098 1036.8959 1062.6666 1125.9232 1164.0061 1256.4195 1314.9817 1349.9750 1401.6287 1422.1226 1458.7366 1528.7206 3223.5472 3243.4674 3255.8345 3572.4919
redmass: 6.6795 6.0360 5.9282 9.1836 7.6653 4.6574 3.2295 2.0273 1.9577 12.0383 1.2087 1.3504 5.7123 1.3672 3.6361 1.3158 1.5791 1.2655 9.5561 1.4054 5.5861 11.0239 5.8864 3.9063 3.8341 4.3335 1.0916 1.0996 1.1077 1.0816
irintensity: 0.5851 0.0752 4.3567 2.6031 0.3152 0.8814 15.4264 10.1138 70.6525 9.0708 136.6403 22.8717 3.4882 1.8400 13.4462 36.6770 28.7124 44.0130 117.5719 2.0044 228.5336 165.2345 94.4245 24.5927 11.1866 24.9877 1.8684 0.2524 2.2261 108.7538
temp: 298.150 k
press: 1.00000 atm
elementType: 8 8 7 7 6 6 6 6 1 1 1 1
symmnumber: 1
zpe: 218172.6 jmol-1
zpe.correction: 0.083098 hartree
zpe.thermalcorrener: 0.089401 hartree
zpe.thermalcorrenthalpy: 0.090345 hartree
zpe.thermalcorrgfe: 0.052364 hartree
zpe.sumelectzpe: -414.102679 hartree
zpe.sumelectthermal: -414.096375 hartree
zpe.sumelectthermalent: -414.095431 hartree
zpe.sumelectthermalfe: -414.133413 hartree
dipole: -5.3299 -1.3148 -0.0007
dipole: 5.4897
quadrupole: -49.9806 -40.6694 -47.3590
quadrupole: 1.4395 -0.0020 -0.0004
quadrupole: -3.9776 5.3336 -1.3560 1.4395 -0.0020 -0.0004
hfenergy: -414.1857763 hartree
pointgroup: C01 [X(C4H4N2O2)]
dipole: -2.0959329 -0.5213504 -0.0007371 debye
dipolederiv: -0.7536868 -0.196788 -0.0000898 -0.3854118 -0.678585 -0.0000835 -0.0004264 -0.0003877 -0.2370078 -0.6793806 0.1513133 0.0000363 0.3849838 -0.7749395 -0.0002757 -0.0000779 0.0000226 -0.2680456 0.04914 0.2785841 0.0001082 0.323941 -0.5894982 -0.0001348 0.0002422 -0.0002141 -0.1893342 2.0233942 -0.0257006 0.0001991 -0.0293407 1.1605169 0.0003375 0.0004126 0.0003703 0.2251562 -1.1125453 0.047394 -0.0001378 0.1899604 0.2600103 0.0001659 -0.0000112 0.0000601 0.0137031 0.4912116 0.0723065 0.0001163 -0.1687188 -0.0378195 -0.0000104 0.0000358 0.0000574 -0.149986 -0.2108841 -0.2387755 -0.0001578 0.1822936 0.3071056 0.0001651 0.0000743 0.0001867 -0.1339161 -0.2018753 -0.0959114 -0.0000447 -0.4585708 -0.1476649 -0.0000455 -0.0001001 0.0000346 -0.2312908 0.2197717 0.0403118 0.0000177 -0.0197162 0.314985 0.0000048 -0.000025 0.0000278 0.3479588 0.1121278 -0.0473362 -0.0000286 -0.0221538 0.0597673 -0.0000482 -0.0000254 -0.0000479 0.208592 0.0709252 -0.0459693 -0.0000172 -0.0577779 0.038237 -0.0000449 -0.0000996 -0.00007 0.2138083 -0.0081983 0.0605713 -0.0000017 0.0605112 0.087885 -0.0000302 0.0000007 -0.0000398 0.2003621 unknown
polarizability: 102.1676382|0.9185901|72.1075887|0.0114863|0.0154516|25.336184 unknown
InChI: InChI=1S/C4H4N2O2/c7-6(8)4-2-1-3-5-4/h1-3,5H
charge 0 multiplicity 1
12 atoms
O  2.155881 1.098379 0.000826
O  1.999494 -1.199294 -0.000079
N  -0.703999 -1.093709 -0.000623
N  1.475408 -0.001278 -0.000156
C  0.049513 0.07707 -0.000157
C  -0.816511 1.185179 0.000207
C  -2.044464 -0.755078 -0.000436
C  -2.141722 0.654726 -0.00017
H  -0.274418 -2.02057 -0.00092
H  -0.506728 2.227174 0.000586
H  -2.824918 -1.512907 -0.000667
H  -3.068536 1.224708 -0.000111
