program: Gaussian 09
title: 000096707
version: EM64L-G09RevD.01
frameworkgroup: C1[X(C7H8N2O)]
method: RPBEPBE
basis: SDD
operation: Freq
keyword: #pfreq=noraman
keyword: PBEPBE/SDD
title: #p freq=noraman PBEPBE/SDD
converged: YES YES NO NO
title: Mulliken charges:
elementType: O N N C C C C C C C H H H H H H H H
charge: -0.277620 -0.389114 -0.002572 0.295332 0.192735 -0.283487 -0.301077 -0.324051 -0.331862 -0.606371 0.274866 0.214535 0.309417 0.246630 0.242743 0.230059 0.230061 0.279776
chargesum: 0.00000
title: Mulliken charges with hydrogens summed into heavy atoms:
elementType: O N N C C C C C C C
charge: -0.277620 -0.079697 -0.002572 0.295332 0.192735 -0.008621 -0.086542 -0.077421 -0.089119 0.133525
polarizability: 1.24346767e+02 -4.18189732e+00 9.77127653e+01 -5.72091322e-01 1.60445632e+00 4.43090764e+01
1716.lowfreq: -9.3426 -1.8466 -0.0008 -0.0003 -0.0003 6.4404 41.1427 104.4789 114.6760
frequency: 41.1087 104.4703 114.6710 149.4059 223.4065 305.9753 343.0368 365.9796 425.8932 501.0794 562.9317 656.9980 660.0473 693.1074 753.6960 806.2957 838.3213 891.5693 958.0565 964.9000 989.9983 1001.1385 1061.8398 1086.0852 1121.5068 1136.1944 1154.9845 1221.1063 1273.6153 1300.7568 1325.4548 1398.6432 1418.9657 1452.3041 1465.6941 1487.6520 1519.7573 1546.6436 1582.6722 1607.4148 2981.6564 3061.9532 3114.3768 3125.5794 3140.7622 3149.5222 3175.0410 3565.1696
redmass: 4.1924 1.5358 1.8191 3.9307 4.5821 4.7733 5.3075 2.4960 5.6755 4.8921 1.1524 6.4627 6.8706 4.1304 2.8596 3.6786 1.7077 1.2644 2.7859 2.0811 1.4548 4.4799 2.0597 1.5899 1.2937 1.6640 3.1938 1.2886 2.5078 6.4383 1.5100 1.8485 1.1862 1.4418 1.5641 1.0459 1.5414 7.4898 5.5146 7.5588 1.0349 1.1024 1.0983 1.0871 1.0897 1.0973 1.0963 1.0773
irintensity: 6.4057 0.2209 1.5860 4.0172 7.6344 15.0225 3.1801 0.3839 7.7449 1.9567 122.9370 9.6820 2.3821 29.6892 15.4132 4.8407 35.5074 3.3705 1.3009 1.6224 1.0914 9.7832 7.1606 0.9940 0.1183 53.6978 1.2810 0.2530 99.2411 0.0431 1.0563 10.0028 36.4893 84.4677 10.5268 17.2580 144.9638 56.5151 5.4607 113.3609 67.3675 34.3666 1.4141 7.6108 27.4642 19.0843 4.6773 14.3672
temp: 298.150 k
press: 1.00000 atm
elementType: 8 7 7 6 6 6 6 6 6 6 1 1 1 1 1 1 1 1
symmnumber: 1
zpe: 369810.2 jmol-1
zpe.correction: 0.140853 hartree
zpe.thermalcorrener: 0.150003 hartree
zpe.thermalcorrenthalpy: 0.150947 hartree
zpe.thermalcorrgfe: 0.105779 hartree
zpe.sumelectzpe: -455.546075 hartree
zpe.sumelectthermal: -455.536926 hartree
zpe.sumelectthermalent: -455.535981 hartree
zpe.sumelectthermalfe: -455.581149 hartree
dipole: 2.3365 -3.3919 0.8796
dipole: 4.2116
quadrupole: -62.1800 -54.2168 -60.7677
quadrupole: -9.7235 1.9555 1.6874
quadrupole: -3.1252 4.8381 -1.7129 -9.7235 1.9555 1.6874
hfenergy: -455.6869284 hartree
pointgroup: C01 [X(C7H8N2O1)]
dipole: 0.8918495 1.3427112 -0.3838129 debye
dipolederiv: -0.7272997 0.2056242 -0.0364109 -0.0663702 -0.8919443 0.1565728 0.0426474 0.1186112 -0.3996911 -0.9056454 -0.3478345 0.1183549 -0.3285225 -0.6489348 0.0305255 0.1179171 0.0084648 -0.4848329 -0.3677622 -0.0120502 -0.0025512 0.0443329 -0.3121225 -0.0107898 0.0012635 -0.005739 -0.2472257 -0.1275013 0.0110498 -0.0067681 0.083006 0.0915161 0.0328992 -0.0463509 0.0264358 0.0271477 1.2999744 0.1227057 -0.0667476 0.3778322 1.2327937 -0.3037175 -0.1352162 -0.2329518 0.2782848 -0.2833713 -0.2033175 -0.0217583 -0.005371 -0.0327992 0.0074613 -0.0218353 -0.0217646 -0.0677038 -0.2027082 0.2034767 0.0365715 0.0319957 -0.092489 0.0147503 0.0666117 0.0193407 -0.102626 0.2889802 0.2748965 0.0389127 0.070735 0.2255208 0.033741 0.0206797 0.0411823 -0.0706613 0.1492812 -0.2151958 -0.018925 -0.089976 0.2807156 0.0429737 0.0039644 0.0335443 -0.0676877 0.4918804 0.1327354 -0.0409638 -0.1013645 0.00548 0.0776609 0.0027139 0.070028 0.2419249 0.1300548 0.0699158 0.0058318 0.0280816 0.0184183 -0.0188565 0.0173854 -0.0039956 0.1542457 0.0123135 -0.1262181 -0.0188394 -0.1059978 -0.0271313 -0.0263206 -0.0301084 -0.0180536 0.1433652 0.1503659 0.0534381 -0.0174355 0.0802206 0.144469 0.0562401 -0.0388744 0.0567297 0.3235367 0.0153155 -0.0992214 -0.0141321 -0.0844632 -0.0462935 -0.0219855 -0.0137111 -0.0236871 0.1338546 0.0509996 0.0704579 0.0055197 0.0641999 -0.0918486 -0.0266601 0.0019702 -0.0267814 0.1339658 -0.0631417 -0.0756563 -0.0247231 -0.0983775 0.009562 -0.1237924 -0.0879139 -0.1231571 -0.0004486 -0.055751 -0.0486127 0.0603318 -0.0259689 0.1177041 0.0438505 0.1292422 0.0472963 -0.1178384 0.144015 -0.0161936 0.0037326 0.1260076 0.0173837 0.0354471 -0.0303853 0.034497 0.1223901 unknown
polarizability: 124.1999514|4.6304064|97.8965429|-0.7281574|0.5718604|44.2721149 unknown
InChI: InChI=1S/C7H8N2O/c1-8-7(10)6-2-4-9-5-3-6/h2-5,8H,1H3
charge 0 multiplicity 1
18 atoms
O  1.838407 -1.499268 0.306392
N  2.203612 0.737251 -0.237269
N  -2.946157 0.26059 -0.039783
C  -0.106973 -0.075269 0.012563
C  1.38224 -0.34207 0.045408
C  -0.972937 -1.188203 -0.121539
C  -0.694438 1.209423 0.139358
C  -2.367638 -0.974952 -0.148936
C  -2.103031 1.324863 0.108618
C  3.666927 0.624346 -0.229165
H  -0.543248 -2.191597 -0.192952
H  -0.093907 2.112678 0.297002
H  1.783535 1.622227 -0.522104
H  -3.06136 -1.815464 -0.259788
H  -2.585386 2.30343 0.212195
H  4.117145 1.331637 0.491297
H  4.089903 0.815075 -1.232779
H  3.917305 -0.404997 0.072182
