program: Gaussian 09
title: 000096732
version: EM64L-G09RevD.01
frameworkgroup: C1[X(C17H18O2)]
method: RPBEPBE
basis: SDD
operation: Freq
keyword: #pfreq=noraman
keyword: PBEPBE/SDD
title: #p freq=noraman PBEPBE/SDD
converged: NO YES NO NO
title: Mulliken charges:
elementType: O O C C C C C C C C C C C C C C C C C H H H H H H H H H H H H H H H H H H
charge: -0.397578 -0.258574 -0.004084 -0.471353 0.391691 0.382555 -0.378968 0.122505 -0.415230 -0.410138 -0.310823 -0.376429 -0.701538 -0.265642 -0.239058 -0.262226 -0.247806 -0.243203 -0.246339 0.217287 0.254191 0.232229 0.221390 0.244737 0.290027 0.237553 0.259232 0.216619 0.221074 0.207126 0.224841 0.224522 0.225454 0.224999 0.227650 0.227723 0.375588
chargesum: 0.00000
title: Mulliken charges with hydrogens summed into heavy atoms:
elementType: O O C C C C C C C C C C C C C C C C C
charge: -0.021991 -0.258574 -0.004084 0.000125 0.391691 0.382555 0.074651 0.122505 -0.170494 -0.120111 -0.073270 -0.117197 -0.056719 -0.040800 -0.014536 -0.036772 -0.022808 -0.015554 -0.018616
polarizability: 2.11136733e+02 -1.22494027e+01 1.82065335e+02 -1.03058200e+01 7.48341714e+00 1.49976163e+02
1716.lowfreq: -10.7794 -2.6827 -0.0009 0.0002 0.0006 2.7192 14.3934 28.7875 54.0141
frequency: 13.9965 28.5539 53.9411 57.3313 69.5159 87.1175 135.1202 154.4346 170.4363 217.8256 234.1778 266.4001 271.6086 280.8774 303.5194 314.5989 337.9062 358.5093 403.8837 410.2627 489.4503 509.6264 544.8804 599.9814 614.3238 617.2506 622.6541 647.2805 685.9433 707.0829 709.0887 722.9835 751.4022 765.1308 771.8040 834.4219 852.8596 862.3794 872.9121 908.6548 925.9126 937.1181 942.2200 976.8616 988.7265 990.7820 992.0532 993.4655 998.8688 1007.6695 1032.6768 1033.0860 1055.0896 1071.4063 1089.9587 1092.1890 1107.4502 1128.2541 1159.6005 1173.7095 1174.1999 1201.9133 1204.5587 1209.3081 1251.6487 1276.1643 1300.9190 1312.2993 1326.9416 1333.8512 1354.1703 1373.5407 1377.8495 1390.2844 1433.4052 1435.0803 1467.7988 1475.6730 1479.1126 1479.9554 1488.5774 1491.0847 1586.5638 1591.0359 1607.0181 1613.3973 1628.1991 2972.5949 2988.3605 3000.3792 3034.4834 3058.9810 3073.8524 3076.5124 3122.2472 3122.6176 3129.7707 3133.5074 3143.9048 3149.7506 3154.1185 3160.7755 3165.9094 3169.7848 3487.2304
redmass: 7.3064 4.0157 3.2541 3.4172 4.0868 3.8191 3.1033 2.3558 5.3571 2.2840 1.8668 4.2002 3.2286 4.1934 4.5712 3.0499 3.5268 7.9912 2.8843 2.8352 3.7537 3.6180 2.7438 3.3490 5.5117 6.1722 4.8735 1.7350 4.3014 1.6622 1.7938 2.7920 1.3546 2.0662 1.8345 1.6915 1.2491 1.2499 3.1738 1.7860 1.7777 1.6879 1.7195 1.3887 1.7028 3.2452 5.1625 1.3392 2.0041 2.3451 2.3596 2.2996 2.6929 2.6350 1.6629 1.6417 2.2363 1.8454 3.5168 1.0538 1.0526 1.2877 1.1385 1.9659 1.4516 1.3397 1.8133 1.2046 1.3616 1.3694 1.4322 6.4367 7.1585 1.2077 2.2711 2.2453 1.1247 1.0425 1.0609 2.0394 1.9779 1.1020 5.9670 5.8371 5.8901 6.0655 8.1230 1.0358 1.0616 1.0607 1.0980 1.1008 1.1008 1.1003 1.0845 1.0847 1.0879 1.0892 1.0932 1.0935 1.0952 1.0961 1.1005 1.0976 1.0634
irintensity: 2.6195 0.5195 0.0421 0.1983 0.0861 0.4722 0.0078 0.2380 0.8315 0.2990 0.2148 0.8332 0.3200 0.4325 0.8155 0.4491 2.2507 2.5210 0.1201 0.0581 0.6695 11.4369 7.2345 71.3295 3.0334 0.7761 11.2764 106.3226 14.2626 53.4229 59.0207 12.4951 17.2369 22.8241 38.4191 1.9764 0.0798 0.6234 2.7773 5.4371 4.5927 5.2883 1.6507 0.1714 0.3386 0.3402 2.6754 0.4960 8.7015 19.1352 6.6891 14.8194 137.6914 88.3188 23.5176 3.0073 10.4431 12.9386 3.2490 0.0389 0.0406 1.7283 5.0646 4.4038 2.2456 6.4601 20.9786 1.0889 2.5794 3.6331 0.3706 1.2185 0.3952 11.4951 16.5297 5.3535 23.8830 8.6867 2.1172 44.0292 10.5212 15.5960 1.2655 2.2398 10.5007 31.7200 140.4875 38.6692 7.3293 31.1109 0.5501 1.3008 63.0321 58.2410 2.2223 0.0444 3.0693 15.0921 30.5224 25.2487 39.0253 11.9944 14.6666 18.9668 25.5250
temp: 298.150 k
press: 1.00000 atm
elementType: 8 8 6 6 6 6 6 6 6 6 6 6 6 6 6 6 6 6 6 1 1 1 1 1 1 1 1 1 1 1 1 1 1 1 1 1 1
symmnumber: 1
zpe: 795316.6 jmol-1
zpe.correction: 0.302920 hartree
zpe.thermalcorrener: 0.320521 hartree
zpe.thermalcorrenthalpy: 0.321465 hartree
zpe.thermalcorrgfe: 0.255582 hartree
zpe.sumelectzpe: -807.684631 hartree
zpe.sumelectthermal: -807.667030 hartree
zpe.sumelectthermalent: -807.666086 hartree
zpe.sumelectthermalfe: -807.731969 hartree
dipole: 1.0594 -0.5564 -0.3846
dipole: 1.2568
quadrupole: -107.6257 -109.7187 -105.8124
quadrupole: 1.9865 0.1382 0.3095
quadrupole: 0.0932 -1.9998 1.9066 1.9865 0.1382 0.3095
hfenergy: -807.987551 hartree
pointgroup: C01 [X(C17H18O2)]
dipole: 0.3818162 0.2325943 0.211255 debye
polarizability: 206.7411882|12.1602844|181.9199816|15.8557045|12.9035223|154.5170607 unknown
InChI: InChI=1S/C17H18O2/c1-2-13-17(16(18)19,14-9-5-3-6-10-14)15-11-7-4-8-12-15/h3-12,18H,2,13H2,1H3
charge 0 multiplicity 1
37 atoms
O  1.431468 -0.593268 -2.361436
O  -0.35229 -2.030372 -2.193802
C  0.130454 -0.542755 -0.254737
C  0.254546 -1.802025 0.693219
C  1.143069 0.580511 0.06779
C  -1.329812 -0.003369 -0.069261
C  1.525924 -2.669433 0.524676
C  0.332056 -1.115122 -1.676637
C  1.981942 0.554482 1.207728
C  -2.445873 -0.569548 -0.740141
C  1.177514 1.738105 -0.755227
C  -1.570167 1.012589 0.894282
C  1.62056 -3.747259 1.626273
C  2.844247 1.63663 1.505878
C  -3.755978 -0.112052 -0.472523
C  2.033765 2.817719 -0.465212
C  -2.881092 1.460346 1.167933
C  2.878745 2.772106 0.669562
C  -3.983522 0.904154 0.481764
H  0.166012 -1.44314 1.736615
H  -0.631325 -2.435453 0.504805
H  2.435308 -2.040478 0.537822
H  1.499958 -3.164851 -0.465426
H  1.971581 -0.303384 1.886569
H  -2.294316 -1.371012 -1.468184
H  0.523604 1.792653 -1.632421
H  -0.729427 1.464661 1.42942
H  0.724256 -4.395647 1.625801
H  2.504837 -4.393632 1.479451
H  1.700668 -3.288148 2.630084
H  3.484221 1.588005 2.394258
H  -4.600297 -0.558085 -1.010704
H  2.040954 3.696266 -1.120094
H  -3.037621 2.246117 1.915804
H  3.546023 3.610539 0.898553
H  -5.000894 1.254789 0.688723
H  1.507201 -1.07094 -3.233904
