program: Gaussian 09
title: 000096725
version: EM64L-G09RevD.01
frameworkgroup: C1[X(C12H17NO6)]
method: RPBEPBE
basis: SDD
operation: Freq
keyword: #p
keyword: freq=noraman
keyword: PBEPBE/SDD
title: #p freq=noraman PBEPBE/SDD
converged: YES YES NO NO
title: Mulliken charges:
elementType: O O O O O O N C C C C C C C C C C C C H H H H H H H H H H H H H H H H H
charge: -0.295901 -0.425263 -0.418898 -0.306020 -0.460363 -0.438548 -0.698199 -0.075159 -0.130642 -0.176091 -0.102481 -0.039849 -0.351437 0.343384 -0.356829 -0.338564 -0.394393 -0.393593 0.511623 0.193845 0.254553 0.247666 0.229122 0.220242 0.214531 0.216724 0.356964 0.340143 0.363951 0.357576 0.239665 0.252025 0.220797 0.223577 0.307241 0.308602
chargesum: 0.00000
title: Mulliken charges with hydrogens summed into heavy atoms:
elementType: O O O O O O N C C C C C C C C C C C C
charge: -0.295901 -0.068299 -0.078755 -0.306020 -0.096412 -0.080971 -0.082357 0.118685 0.123911 0.071575 0.126640 0.180393 0.079817 0.343384 -0.117165 -0.086539 -0.173596 -0.170016 0.511623
polarizability: 2.13271657e+02 7.53126422e+00 1.53263294e+02 -9.64628813e+00 1.29590666e+01 1.07117163e+02
1716.lowfreq: -7.7980 -0.0006 -0.0005 -0.0002 1.8774 6.2966 17.1382 29.9425 38.4479
frequency: 16.7627 29.9257 38.4318 71.5753 92.8496 102.5429 119.3186 160.4300 163.9389 180.7380 222.9955 249.7998 267.5639 292.4037 321.2599 339.8389 350.5988 361.0157 366.7343 375.4470 393.0214 416.3296 419.6019 424.5285 445.1698 449.8628 460.2132 468.2839 500.3471 520.0800 571.6484 583.7954 636.8595 665.1099 712.7547 729.8381 758.1121 806.0067 812.7885 827.1321 828.2721 851.9937 920.1803 933.0742 942.6212 947.9811 963.6153 989.8772 996.1697 1010.9013 1015.1458 1016.0147 1041.8561 1053.4457 1066.1468 1104.0018 1119.0924 1120.4107 1157.1098 1172.0770 1185.6876 1190.8135 1206.7855 1226.8628 1245.0161 1256.1815 1286.0747 1294.8657 1300.3198 1315.4785 1319.7225 1328.8795 1338.8227 1360.2603 1373.7474 1381.0184 1382.0457 1386.5315 1390.2028 1433.0581 1465.6741 1504.7831 1586.3014 1628.4157 1645.4024 2916.7235 2942.5734 2973.3899 2995.0317 3000.0055 3066.5763 3084.4194 3125.8714 3128.5305 3155.7244 3169.0757 3504.1831 3530.3860 3535.1866 3569.1237 3573.7115 3708.6326
redmass: 3.9332 5.6264 5.8708 6.3621 4.5028 5.9885 6.3802 4.6008 3.4871 4.9741 5.1546 4.6588 4.9705 3.7522 4.7579 3.9493 4.4127 1.3275 1.0615 2.9734 1.3263 2.7280 2.4461 1.2759 3.7912 1.8241 1.3606 1.9704 3.5319 3.9445 3.3778 3.6074 6.8425 4.2915 3.7535 4.3137 4.7958 1.2712 3.5021 2.4775 3.2565 3.4073 3.7651 1.3847 3.1759 1.4352 3.1451 4.1768 2.8453 4.6001 2.6986 1.9853 2.6395 2.5569 2.6697 3.2240 1.3648 1.7193 1.6172 1.1586 1.4809 1.5507 1.3206 1.2915 1.3324 1.2667 1.2202 1.3276 1.3498 3.1112 1.3156 1.3128 1.3318 1.3921 1.1886 1.3952 5.1523 1.5421 1.3821 3.5319 1.0876 3.0821 7.3711 3.0915 1.4345 1.0818 1.0842 1.0828 1.0656 1.0840 1.0871 1.0993 1.0888 1.0889 1.0961 1.0956 1.0651 1.0654 1.0653 1.0450 1.0659 1.1041
irintensity: 0.1186 0.6253 0.2555 1.3711 9.7768 0.5490 1.8911 0.2426 7.8265 4.7186 7.4766 8.7436 7.3072 1.3425 1.4495 20.6941 11.7830 293.9645 12.2039 9.3285 100.4159 0.6582 31.4098 65.7955 23.3050 122.8441 177.7041 115.7797 1.4562 9.7604 16.9700 4.9874 0.4788 67.0894 6.3451 27.5141 16.3825 0.9276 44.1180 30.5764 24.7208 48.7185 215.3259 2.0925 61.2415 9.4964 58.9730 53.6064 18.8406 72.9173 99.5328 54.8970 52.3306 34.8135 52.6936 16.6488 8.4983 41.0356 35.0038 45.0932 55.9123 99.8583 20.8277 27.0610 29.0817 13.0791 3.5563 0.7318 31.0471 28.1798 12.2138 20.7112 9.2935 34.5407 26.6778 23.2520 5.7552 16.9665 7.1288 1.1788 5.6304 239.3882 0.3261 7.4585 237.0658 31.6932 30.1677 21.4673 40.5576 48.3193 13.4033 31.9766 11.8008 29.7961 11.0905 3.4583 5.1487 16.9080 17.7376 78.9866 15.2545 22.0398
temp: 298.150 k
press: 1.00000 atm
elementType: 8 8 8 8 8 8 7 6 6 6 6 6 6 6 6 6 6 6 6 1 1 1 1 1 1 1 1 1 1 1 1 1 1 1 1 1
symmnumber: 1
zpe: 747592.7 jmol-1
zpe.correction: 0.284743 hartree
zpe.thermalcorrener: 0.303862 hartree
zpe.thermalcorrenthalpy: 0.304807 hartree
zpe.thermalcorrgfe: 0.236503 hartree
zpe.sumelectzpe: -972.058925 hartree
zpe.sumelectthermal: -972.039806 hartree
zpe.sumelectthermalent: -972.038861 hartree
zpe.sumelectthermalfe: -972.107165 hartree
dipole: 6.4306 -1.6207 -1.4512
dipole: 6.7886
quadrupole: -100.1963 -114.2613 -112.9739
quadrupole: 2.6107 1.5931 5.2345
quadrupole: 8.9475 -5.1174 -3.8301 2.6107 1.5931 5.2345
hfenergy: -972.343668 hartree
pointgroup: C01 [X(C12H17N1O6)]
dipole: -2.4997664 -0.5791703 0.7410661 debye
polarizability: 213.5000423|-7.6880788|145.1595805|-8.9497553|-21.5486162|114.9924911 unknown
InChI: InChI=1S/C12H17NO6/c13-6-1-3-7(4-2-6)18-12-11(17)10(16)9(15)8(5-14)19-12/h1-4,8-12,14-17H,5,13H2
charge 0 multiplicity 1
36 atoms
O  0.882599 0.748355 -0.43055
O  4.425986 -1.341801 0.4725
O  3.561229 0.732869 -1.445577
O  -0.339573 -1.288119 -0.468141
O  1.908964 -2.630865 0.88072
O  0.546714 3.521168 -0.037684
N  -5.707245 0.334056 0.360831
C  3.18411 -0.609119 0.659099
C  3.293347 0.785471 -0.006943
C  1.982881 -1.392747 0.096814
C  1.962675 1.52987 0.258784
C  0.691778 -0.567164 0.226335
C  1.862109 2.942278 -0.322268
C  -1.685659 -0.840838 -0.231591
C  -2.477425 -1.514221 0.721322
C  -2.225234 0.215431 -0.995597
C  -3.817225 -1.125458 0.920546
C  -3.563338 0.60735 -0.798239
C  -4.381077 -0.05454 0.165899
H  2.992502 -0.450386 1.747245
H  4.155028 1.324681 0.422301
H  2.143289 -1.621275 -0.977147
H  1.73678 1.564762 1.346064
H  0.414652 -0.396881 1.291705
H  2.073089 2.917523 -1.409862
H  2.59494 3.605691 0.166646
H  4.266079 -2.269499 0.788822
H  2.715418 0.464748 -1.894952
H  1.207596 -3.207717 0.485141
H  -0.132118 2.856588 -0.327846
H  -2.047771 -2.342157 1.295624
H  -1.597473 0.709728 -1.743106
H  -4.432584 -1.652003 1.659808
H  -3.982749 1.426429 -1.394675
H  -6.292964 -0.133918 1.045699
H  -6.10943 1.099911 -0.171026
