program: Gaussian 09
title: 000096695
version: EM64L-G09RevD.01
frameworkgroup: C1[X(C9H6N2O2)]
method: RPBEPBE
basis: SDD
operation: Freq
keyword: #pfreq=noraman
keyword: PBEPBE/SDD
title: #p freq=noraman PBEPBE/SDD
converged: NO NO NO NO
title: Mulliken charges:
elementType: O O N N C C C C C C C C C H H H H H H
charge: -0.386518 -0.236650 0.050045 -0.003674 0.060043 0.078481 -0.320028 -0.306940 0.049348 -0.212360 -0.209993 -0.376537 0.128126 0.270483 0.265503 0.240496 0.284007 0.239893 0.386275
chargesum: 0.00000
title: Mulliken charges with hydrogens summed into heavy atoms:
elementType: O O N N C C C C C C C C C
charge: -0.000243 -0.236650 0.050045 -0.003674 0.060043 0.078481 -0.049545 -0.041437 0.049348 0.028136 0.029900 -0.092529 0.128126
polarizability: 1.99969766e+02 -1.08903422e+01 1.18381843e+02 1.34075855e-03 2.28983516e-03 4.46810207e+01
1716.lowfreq: -0.0006 -0.0003 0.0005 9.4101 11.7526 19.1356 45.5586 83.9594 156.3916
frequency: 45.4606 83.9084 156.3916 173.6855 247.2085 325.7171 354.6008 409.0741 471.9856 488.5790 500.7877 523.3683 563.5997 597.4886 599.3332 654.6821 675.5573 742.2024 745.5317 783.7280 810.0824 870.9218 894.3416 943.4048 947.0692 980.4242 1005.5354 1008.6519 1029.7698 1110.6991 1152.5695 1176.9936 1202.8906 1251.0460 1274.8496 1316.8668 1348.2731 1371.7460 1412.4710 1457.6350 1475.7138 1512.1043 1547.2968 1609.0837 1623.3342 3137.6165 3152.1071 3161.5685 3167.9651 3176.1971 3501.2509
redmass: 10.0505 5.5211 6.7964 4.3558 5.6277 9.0069 6.4764 4.5342 3.2425 3.9592 6.4872 7.0576 6.8674 1.7157 8.6334 2.0893 5.5470 3.5248 5.7906 1.4832 3.1038 6.3455 1.7290 6.8366 1.4640 1.3637 1.3354 2.1523 3.6623 1.8065 1.3341 1.6078 2.1534 2.3388 2.4264 2.4473 3.1887 2.9306 3.9337 3.0870 3.5029 7.5906 6.8135 7.2326 7.7409 1.0865 1.0900 1.0932 1.0958 1.1003 1.0640
irintensity: 0.9833 0.8870 1.6578 3.4516 0.1092 4.3614 1.3985 6.2594 7.2393 0.6735 18.4915 2.3244 29.0359 82.6698 2.9513 78.9004 27.9032 0.0401 10.7265 103.6655 6.4892 3.2647 0.0713 31.6648 14.1372 6.2444 0.0014 5.3284 278.6677 21.3656 8.9179 31.6357 3.8358 4.5439 0.9209 32.9506 70.9174 3.6988 10.8591 26.3966 22.5152 5.8622 19.3073 133.2073 126.6693 3.1848 7.0820 0.6707 8.8145 19.6122 46.3401
temp: 298.150 k
press: 1.00000 atm
elementType: 8 8 7 7 6 6 6 6 6 6 6 6 6 1 1 1 1 1 1
symmnumber: 1
zpe: 351542.8 jmol-1
zpe.correction: 0.133896 hartree
zpe.thermalcorrener: 0.143645 hartree
zpe.thermalcorrenthalpy: 0.144590 hartree
zpe.thermalcorrgfe: 0.097883 hartree
zpe.sumelectzpe: -605.610004 hartree
zpe.sumelectthermal: -605.600254 hartree
zpe.sumelectthermalent: -605.599310 hartree
zpe.sumelectthermalfe: -605.646016 hartree
dipole: 2.6475 -1.6264 0.0001
dipole: 3.1072
quadrupole: -59.6857 -75.6063 -75.7124
quadrupole: 3.9005 -0.0002 -0.0006
quadrupole: 10.6491 -5.2715 -5.3776 3.9005 -0.0002 -0.0006
hfenergy: -605.7438995 hartree
pointgroup: C01 [X(C9H6N2O2)]
dipole: -1.0528116 -0.6212912 -0.000026 debye
dipolederiv: -0.5015625 0.3354969 -0.0000012 0.5816577 -1.0952331 -0.0000162 0.0000766 -0.0001529 -0.3943957 -1.0679514 -0.2720659 -0.0000567 -0.0445495 -0.729019 -0.000073 0.0000937 0.0000666 -0.3200638 0.2139373 -0.0294426 0.0000059 0.1056014 -0.2089948 -0.00001 -0.0000513 0.0000099 -0.2321562 -0.2122 -0.0244939 -0.0000019 0.064242 -0.1908717 -0.0000026 0.0000086 -0.0000029 -0.270128 -0.2092257 0.0240134 -0.0000057 0.5201662 -0.004277 0.0000229 -0.0000177 0.0000044 0.1185892 0.3198679 0.1959986 -0.0000017 -0.4065383 -0.111898 0.0000041 0.0000412 0.0000146 0.119702 -0.0204695 -0.0870995 0.000008 0.0165048 0.1038349 -0.0000191 0.0000056 -0.0000175 -0.1503736 -0.2084733 -0.1262665 0.0000065 -0.123309 0.1058904 -0.000017 -0.0000044 -0.000014 -0.1503471 -0.4610787 0.0540625 0.0000205 -0.3412357 -0.022909 0.0000031 -0.0000244 0.0000032 0.1388812 -0.0535602 0.1629288 -0.0000028 0.2211405 0.0698027 -0.0000072 -0.000012 -0.0000068 -0.1412379 0.1609059 -0.0877239 0.000018 -0.1206174 0.0134067 -0.0000114 0.0000201 -0.0000118 -0.1310013 -0.0154389 0.0349316 0.0000103 0.195903 0.1941357 0.0000024 -0.000051 0. 0.0248944 1.8316569 -0.0863324 0.0000034 -0.4736757 1.4488863 0.000092 -0.0001086 0.000087 0.2047633 0.08677 0.0563338 -0.0000061 -0.0015609 -0.0265576 0.0000113 -0.0000004 0.0000106 0.1658967 0.0730281 0.0118796 -0.0000037 0.0719993 -0.03045 0.0000136 -0.0000099 0.0000102 0.1645355 -0.0179971 -0.0991355 -0.0000003 -0.1044097 -0.0058956 0.0000059 -0.0000009 0.0000073 0.1617857 0.0516691 -0.0637402 -0.0000029 -0.0647018 0.0721424 -0.0000003 0.0000114 -0.0000036 0.1314782 -0.1021277 0.0474721 -0.0000124 0.0452417 0.0835073 0.0000061 -0.0000121 0.0000057 0.1594206 0.1322498 -0.0468169 0.000023 -0.1418586 0.3344994 -0.0000044 0.0000354 -0.00001 0.3997569 unknown
polarizability: 200.3306488|9.435339|118.0209596|0.0012999|-0.0023133|44.6810207 unknown
InChI: InChI=1S/C9H6N2O2/c12-9(13)8-5-10-6-3-1-2-4-7(6)11-8/h1-5,12H
charge 0 multiplicity 1
19 atoms
O  3.212259 -1.618224 -0.000042
O  3.825051 0.621892 -0.000006
N  0.557338 -0.950552 0.000145
N  -0.210046 1.837142 -0.000017
C  -0.776151 -0.576612 0.000096
C  -1.166825 0.826207 0.000002
C  -1.786088 -1.59078 0.000119
C  -2.553176 1.16814 -0.000068
C  1.461051 0.053526 0.000128
C  -3.133951 -1.225931 0.000049
C  -3.517549 0.156213 -0.000042
C  1.077137 1.444023 0.000053
C  2.927547 -0.258814 0.000199
H  -1.462377 -2.636012 0.000187
H  -2.821373 2.229055 -0.00014
H  -3.910352 -1.998524 0.000063
H  1.850744 2.217435 0.000064
H  -4.58167 0.416841 -0.000099
H  4.202529 -1.734625 -0.000191
