program: Gaussian 09
title: 000096754
version: EM64L-G09RevD.01
frameworkgroup: C1[X(C24H24N2O2)]
method: RPBEPBE
basis: SDD
operation: Freq
keyword: #p
keyword: freq=noraman
keyword: PBEPBE/SDD
title: #p freq=noraman PBEPBE/SDD
converged: YES YES NO NO
title: Mulliken charges:
elementType: O O N N C C C C C C C C C C C C C C C C C C C C C C C C H H H H H H H H H H H H H H H H H H H H H H H H
charge: -0.246339 -0.246337 -0.126010 -0.125998 0.168122 0.168122 -0.450838 -0.450827 0.132956 0.132948 -0.300719 -0.300727 -0.499558 -0.499565 -0.361561 -0.361557 0.452822 0.452833 -0.446385 -0.446390 -0.370077 -0.370074 -0.219560 -0.219560 -0.230903 -0.230900 -0.244481 -0.244480 0.210176 0.250625 0.210171 0.250625 0.194885 0.225864 0.194884 0.225865 0.200558 0.222677 0.200556 0.222675 0.251701 0.251701 0.231477 0.231479 0.273715 0.273707 0.225315 0.225316 0.227375 0.227375 0.228161 0.228161
chargesum: 0.00000
title: Mulliken charges with hydrogens summed into heavy atoms:
elementType: O O N N C C C C C C C C C C C C C C C C C C C C C C C C
charge: -0.246339 -0.246337 -0.126010 -0.125998 0.168122 0.168122 0.009963 0.009969 0.132956 0.132948 0.120030 0.120022 -0.076323 -0.076335 -0.109860 -0.109855 0.452822 0.452833 -0.214907 -0.214911 -0.096362 -0.096367 0.005755 0.005756 -0.003528 -0.003526 -0.016321 -0.016319
polarizability: 2.35471386e+02 4.31510187e-04 3.15254222e+02 5.92225901e+00 2.70133585e-03 2.47123868e+02
1716.lowfreq: -0.0006 0.0005 0.0005 2.0560 3.8209 11.2275 12.7894 24.7682 30.0370
frequency: 12.7682 24.7527 30.0117 30.3073 36.8779 37.5832 88.2493 96.6862 115.6222 132.0838 144.4475 183.9815 189.5177 206.2621 224.7597 259.1168 275.4726 285.2815 290.5534 309.3789 337.2476 341.9570 382.9461 406.0646 406.2425 412.7016 427.1643 456.3762 470.9761 482.6738 486.7281 501.6536 534.0893 576.8425 585.9339 596.7491 609.3960 616.0718 617.4326 663.7020 705.8667 706.2063 712.9018 726.1945 739.3144 749.4431 756.1059 802.2045 802.9823 817.2563 828.0820 862.0338 862.1089 869.0696 906.3956 914.9521 916.4677 930.4533 942.8505 968.0354 972.6045 975.3588 983.1317 984.9065 986.2307 989.6502 990.1634 992.8679 1003.5885 1004.6083 1024.5609 1024.9563 1028.6625 1058.1574 1059.4396 1080.6275 1081.0954 1137.3027 1140.1289 1148.7610 1170.1816 1170.5628 1170.5656 1181.3388 1181.3882 1197.7082 1200.9847 1201.4106 1204.8485 1209.9652 1211.8168 1223.6130 1251.4086 1256.7948 1265.9284 1293.0165 1296.4912 1308.5421 1310.1675 1344.1733 1344.2370 1361.8353 1363.7719 1380.0679 1382.0189 1389.9450 1395.5140 1396.2859 1441.6578 1441.7280 1445.7383 1451.2906 1459.5117 1459.7395 1469.4123 1470.1619 1478.1699 1482.2532 1483.3632 1484.7019 1595.8235 1595.8575 1608.4785 1611.0267 1614.4319 1614.5552 2811.3695 2811.5778 2853.1407 2853.2369 2865.8800 2866.1943 2990.1840 2990.2560 3009.4941 3013.6553 3090.6499 3090.8269 3111.5406 3111.5579 3123.9083 3123.9092 3136.2470 3136.2511 3147.2209 3147.2647 3156.2908 3162.1308 3162.1594 3177.3808
redmass: 5.6171 4.5856 5.9384 4.5328 3.7741 4.1965 5.6734 3.4638 4.7382 4.4345 2.3510 5.1264 3.6830 3.8810 4.1571 3.0046 4.7695 4.2581 2.4798 2.5039 2.2219 2.8756 4.0863 2.8693 2.9246 4.7754 3.6311 3.5148 4.0491 4.1314 3.8638 5.0194 5.8026 6.0019 3.9323 4.7511 5.4573 6.3332 6.3859 5.4822 2.3810 2.1932 3.7273 4.1282 2.2660 1.6044 2.4296 4.1002 4.0514 1.4852 4.2644 1.2495 1.2761 4.3481 3.9749 1.4173 1.3795 4.5315 1.3465 2.2286 2.1666 3.6600 1.6072 1.4012 1.4824 4.8157 5.7617 1.8397 1.3966 1.3852 2.2081 2.1880 2.4594 2.2214 2.0539 1.5908 1.5980 2.3930 2.0845 1.4303 2.5882 1.0598 1.0611 1.1184 1.1220 2.0068 1.1749 1.1321 1.7521 2.1530 2.2946 1.9518 1.8092 2.7146 1.7448 1.5616 1.4989 1.4493 1.4739 1.4010 1.3499 1.8655 1.7011 2.4065 2.6974 4.0520 2.0228 2.0168 2.0409 2.1669 2.9996 1.6534 1.1354 1.1520 1.4254 1.1419 1.2653 1.8111 1.9077 1.3544 6.1475 6.1430 8.7975 7.5293 6.0903 6.1202 1.0721 1.0712 1.0699 1.0699 1.0708 1.0709 1.0870 1.0870 1.0854 1.0847 1.0921 1.0921 1.0874 1.0874 1.0861 1.0861 1.0912 1.0912 1.0956 1.0956 1.0878 1.1014 1.1014 1.0975
irintensity: 0.0003 0.5696 0.1426 0.3275 0.0031 0.0408 0.9185 1.9932 0.0672 4.7131 0.1327 1.3131 0.6952 0.6845 0.2178 3.7486 0.1263 0.7505 6.9159 0.0079 37.0816 0.2319 2.5731 0.1346 0.4246 0.8556 5.3305 0.1460 17.1875 12.7188 0.8083 0.1857 3.8315 8.1487 1.8246 2.8955 0.8323 0.0894 1.0453 21.2767 0.3042 84.7788 0.0051 0.4931 34.6885 0.6379 81.0710 2.0049 34.8698 62.2124 16.8181 0.4750 0.0045 8.8048 44.9416 0.2463 5.7881 81.8524 1.4704 27.4676 46.3463 142.4563 4.4687 0.8061 0.4332 0.0781 0.9335 0.0265 1.1043 2.7396 19.2855 14.3309 0.2195 19.9730 1.7046 16.8356 8.9410 154.0095 129.2775 2.2156 18.2135 0.4786 1.1756 1.2140 0.8914 16.5038 0.0545 0.1082 127.1072 22.7836 27.3688 11.0111 3.8590 5.6651 71.1386 0.0737 19.4469 4.5737 22.8659 6.9549 16.6355 27.9928 4.2513 25.0691 14.0919 15.1477 8.7213 2.4721 6.8285 18.6636 0.2737 94.0580 1.3148 15.0947 71.9178 1.2763 62.0834 3.1225 6.5702 10.7045 1.4455 0.2324 0.5658 0.9844 6.3299 4.4752 90.2667 35.3727 51.9377 46.6554 329.6156 33.1163 37.3047 3.4794 17.9214 8.9696 67.4951 0.0075 0.3497 17.3651 0.2162 0.2567 28.5369 3.6735 6.8092 49.8462 4.0150 34.3887 18.7882 8.0840
temp: 298.150 k
press: 1.00000 atm
elementType: 8 8 7 7 6 6 6 6 6 6 6 6 6 6 6 6 6 6 6 6 6 6 6 6 6 6 6 6 1 1 1 1 1 1 1 1 1 1 1 1 1 1 1 1 1 1 1 1 1 1 1 1
symmnumber: 1
zpe: 1111852.4 jmol-1
zpe.correction: 0.423482 hartree
zpe.thermalcorrener: 0.446923 hartree
zpe.thermalcorrenthalpy: 0.447867 hartree
zpe.thermalcorrgfe: 0.367384 hartree
zpe.sumelectzpe: -1186.862851 hartree
zpe.sumelectthermal: -1186.839410 hartree
zpe.sumelectthermalent: -1186.838466 hartree
zpe.sumelectthermalfe: -1186.918950 hartree
dipole: 0.0000 -4.1128 -0.0001
dipole: 4.1128
quadrupole: -168.1168 -164.8758 -148.6872
quadrupole: 0.0004 4.6251 0.0005
quadrupole: -7.5569 -4.3159 11.8728 0.0004 4.6251 0.0005
hfenergy: -1187.2863332 hartree
pointgroup: C01 [X(C24H24N2O2)]
dipole: -0.0006396 1.6181192 -0.0000551 debye
polarizability: 236.4228581|-0.0305876|315.2542097|-6.727163|-0.0052608|246.1724086 unknown
InChI: InChI=1S/C24H24N2O2/c1-3-7-19(8-4-1)13-25-15-21-22-16-26(14-20-9-5-2-6-10-20)18-28-24(22)12-11-23(21)27-17-25/h1-12H,13-18H2
charge 0 multiplicity 1
52 atoms
O  2.502288 -2.945579 -1.292837
O  -2.499709 -2.947637 1.292891
N  2.756999 -0.570513 -0.990826
N  -2.756461 -0.572806 0.990781
C  0.639615 -1.632026 -0.311141
C  -0.638196 -1.632555 0.311046
C  1.351126 -0.319042 -0.619145
C  -1.350834 -0.320162 0.618971
C  1.250418 -2.869881 -0.636972
C  -1.247917 -2.870913 0.636995
C  2.878503 -1.671899 -1.934642
C  -2.876957 -1.674245 1.934659
C  3.559253 0.63255 -1.270959
C  -3.559703 0.629591 1.270949
C  0.626221 -4.098449 -0.321319
C  -0.622651 -4.098963 0.321454
C  3.825322 1.472849 -0.021101
C  -3.826565 1.469663 0.021109
C  3.881575 2.885153 -0.105827
C  -3.883823 2.881929 0.105807
C  4.065853 0.847823 1.228163
C  -4.066833 0.844433 -1.228104
C  4.184805 3.663555 1.035364
C  -4.187778 3.660084 -1.03536
C  4.364063 1.623055 2.37019
C  -4.365769 1.619421 -2.370107
C  4.42803 3.034015 2.277581
C  -4.430735 3.030337 -2.277524
H  0.804493 0.238148 -1.426643
H  1.3428 0.336253 0.272089
H  -0.804627 0.23758 1.426375
H  -1.34314 0.335057 -0.272326
H  2.216886 -1.556791 -2.830352
H  3.925888 -1.792944 -2.251175
H  -2.215369 -1.55853 2.830313
H  -3.924214 -1.796164 2.251282
H  3.089656 1.285179 -2.049217
H  4.528417 0.290942 -1.68801
H  -3.090592 1.282619 2.049166
H  -4.52855 0.287179 1.688077
H  1.131195 -5.031581 -0.586971
H  -1.126807 -5.03251 0.587201
H  3.686212 3.379363 -1.066344
H  -3.688669 3.376304 1.066281
H  4.003202 -0.244874 1.28637
H  -4.003414 -0.248221 -1.286293
H  4.225316 4.755964 0.956393
H  -4.229058 4.752465 -0.956411
H  4.548061 1.128928 3.331143
H  -4.549558 1.125137 -3.331019
H  4.660495 3.635239 3.163882
H  -4.663764 3.631371 -3.163806
