program: Gaussian 09
title: 000096678
version: EM64L-G09RevD.01
frameworkgroup: C1[X(C14H15N3)]
method: RPBEPBE
basis: SDD
operation: Freq
keyword: #pfreq=noraman
keyword: PBEPBE/SDD
title: #p freq=noraman PBEPBE/SDD
converged: NO NO NO NO
title: Mulliken charges:
elementType: N N N C C C C C C C C C C C C C C H H H H H H H H H H H H H H H
charge: -0.113846 -0.700032 -0.111390 0.367796 0.316626 -0.577871 0.343798 -0.391213 -0.392003 0.479337 -0.842470 0.360306 -0.552486 -0.412925 -0.404039 -0.187682 -0.806428 0.236789 0.215218 0.232597 0.225926 0.224917 0.239562 0.241743 0.231609 0.238836 0.225171 0.225993 0.237466 0.224033 0.321413 0.303249
chargesum: 0.00000
title: Mulliken charges with hydrogens summed into heavy atoms:
elementType: N N N C C C C C C C C C C C C C C
charge: -0.113846 -0.075370 -0.111390 0.367796 0.316626 -0.341082 0.343798 -0.175996 -0.159406 0.479337 -0.152064 0.360306 -0.310743 -0.181316 -0.165203 0.037488 -0.118935
polarizability: 2.87965334e+02 -3.84619532e-01 1.78321579e+02 6.40274788e+00 8.03378216e-02 8.35164196e+01
1716.lowfreq: -250.1747 -47.7304 -11.8549 -8.4103 -0.0007 -0.0004 0.0006 3.7831 29.9381
frequency: -250.1737 -47.7109 29.8668 37.1804 47.1876 110.0559 155.9279 186.7607 193.5192 204.1940 226.5631 264.3351 303.7619 309.7773 332.6459 367.3033 385.5969 417.4520 427.7131 438.5089 478.7002 515.4851 519.3109 526.3897 549.2800 592.0007 643.1602 692.5312 712.4395 716.6055 758.1142 767.8385 799.7343 820.7086 874.9345 876.8850 894.3552 911.5078 922.7168 932.9905 972.6389 986.0697 987.5772 997.6592 1025.8657 1041.3691 1046.2068 1092.2641 1117.6577 1142.5724 1157.1564 1176.6448 1220.9265 1245.6714 1283.6950 1297.7371 1315.9461 1370.8712 1378.7993 1396.6902 1398.8987 1414.0230 1421.7613 1445.0158 1467.1961 1472.0241 1474.1318 1476.0240 1483.0728 1502.1549 1582.7675 1590.3442 1610.7068 1625.8904 1646.3577 2950.5083 2975.6266 3016.5600 3057.1046 3086.5251 3086.9635 3118.6498 3123.3063 3132.9674 3135.9472 3143.1555 3155.1537 3163.8276 3575.4494 3714.1228
redmass: 9.7066 3.7173 1.0359 4.0652 5.2826 4.9142 3.2264 1.4324 2.4757 2.5793 3.8021 4.5483 2.2261 1.3198 3.1072 1.7802 1.8276 3.1810 3.0273 3.0395 6.5625 4.8783 4.5363 5.3130 4.3161 3.6301 5.6712 2.3728 6.0769 3.0323 3.2165 2.2182 1.6003 2.1876 1.4518 1.4771 1.6049 2.3560 1.6086 3.6168 1.3390 5.0932 1.6146 1.5737 1.4745 1.5072 1.5607 1.6053 1.8493 1.5683 1.4853 1.0943 3.4051 3.4387 1.3278 1.3281 2.8944 4.6246 5.8210 1.2255 1.4065 3.0647 2.8719 13.6393 2.2155 1.0586 1.0447 1.2007 1.2235 2.9765 6.8787 6.1297 6.3702 3.0127 1.4620 1.0395 1.0386 1.0974 1.0949 1.0952 1.0999 1.0883 1.0866 1.0914 1.0916 1.0926 1.0954 1.0982 1.0451 1.1034
irintensity: 3.2395 0.0503 0.4066 0.8563 2.7679 0.1616 0.2335 3.0241 0.5252 1.5300 0.1766 0.2531 43.3874 196.2705 3.3530 40.6633 19.1930 2.4670 1.3492 7.8857 2.4641 1.2361 1.6230 0.9275 3.6216 7.8630 2.1221 21.8209 2.3070 7.7691 1.1915 10.0991 82.9814 1.0349 1.9912 20.6300 5.8984 6.7027 3.7486 0.5002 0.3888 1.1643 5.1743 4.1924 13.4991 6.1835 17.1736 15.2251 6.5772 12.4053 16.4717 0.9371 1.8698 9.9529 2.6497 0.1232 60.5913 1.5980 2.2136 12.5178 12.0100 16.9686 5.3662 4.4384 11.8760 13.0703 13.1940 31.1059 7.1243 177.4708 3.8370 29.9669 44.0748 0.8632 226.0292 49.9088 34.2226 27.6118 23.0045 14.7788 18.6100 25.4275 6.2569 5.9573 11.4652 21.9043 9.1639 16.2994 71.6727 21.7143
temp: 298.150 k
press: 1.00000 atm
elementType: 7 7 7 6 6 6 6 6 6 6 6 6 6 6 6 6 6 1 1 1 1 1 1 1 1 1 1 1 1 1 1 1
symmnumber: 1
zpe: 671370.0 jmol-1
zpe.correction: 0.255711 hartree
zpe.thermalcorrener: 0.270753 hartree
zpe.thermalcorrenthalpy: 0.271697 hartree
zpe.thermalcorrgfe: 0.212645 hartree
zpe.sumelectzpe: -705.486409 hartree
zpe.sumelectthermal: -705.471367 hartree
zpe.sumelectthermalent: -705.470423 hartree
zpe.sumelectthermalfe: -705.529475 hartree
dipole: -2.4720 0.7480 -0.2327
dipole: 2.5931
quadrupole: -61.3278 -85.7820 -110.6372
quadrupole: 1.4023 3.4721 0.0105
quadrupole: 24.5879 0.1337 -24.7215 1.4023 3.4721 0.0105
hfenergy: -705.7421201 hartree
pointgroup: C01 [X(C14H15N3)]
dipole: 0.9718891 0.2937259 0.0999211 debye
polarizability: 287.8592156|0.336996|178.3205797|7.9199155|0.3000209|83.6235367 unknown
InChI: InChI=1S/C14H15N3/c1-10-4-3-5-12(8-10)16-17-13-6-7-14(15)11(2)9-13/h3-9H,15H2,1-2H3
charge 0 multiplicity 1
32 atoms
N  0.016577 -0.279246 -0.565881
N  5.64979 -0.258346 0.273597
N  -0.737581 -0.334166 0.48313
C  3.546436 0.978995 -0.015263
C  4.26311 -0.258535 0.093356
C  2.148582 0.943602 -0.201577
C  1.448247 -0.28061 -0.267353
C  3.547566 -1.48502 0.011385
C  2.152015 -1.500526 -0.171742
C  -4.284333 0.877076 0.013111
C  4.290968 2.296985 0.073431
C  -2.166956 -0.349408 0.202377
C  -2.876871 0.871188 0.174057
C  -4.962231 -0.364615 -0.096393
C  -2.842915 -1.586337 0.092579
C  -4.245994 -1.581291 -0.06151
C  -5.044381 2.189155 -0.068928
H  1.594015 1.885116 -0.29031
H  4.093185 -2.433112 0.09669
H  1.611934 -2.450855 -0.23639
H  4.808914 2.412984 1.04764
H  5.058978 2.38939 -0.721876
H  3.602257 3.15103 -0.034929
H  -2.328176 1.81479 0.274043
H  -6.053031 -0.375112 -0.206983
H  -2.278534 -2.523452 0.128684
H  -4.782287 -2.532587 -0.153524
H  -4.560003 2.977645 0.533461
H  -5.089069 2.554976 -1.113388
H  -6.084606 2.075281 0.283312
H  6.171083 0.609058 0.343819
H  6.159813 -1.132253 0.357573
