program: Gaussian 09
title: 000096679
version: EM64L-G09RevD.01
frameworkgroup: C1[X(C16H18O2)]
method: RPBEPBE
basis: SDD
operation: Freq
keyword: #pfreq=noraman
keyword: PBEPBE/SDD
title: #p freq=noraman PBEPBE/SDD
converged: YES YES NO NO
title: Mulliken charges:
elementType: O O C C C C C C C C C C C C C C C C H H H H H H H H H H H H H H H H H H
charge: -0.467751 -0.434691 0.022345 -0.464897 0.366984 0.390384 -0.400697 -0.328373 -0.360357 -0.387767 -0.430634 -0.406762 -0.228635 -0.235398 -0.241548 -0.223229 -0.241264 -0.244743 0.198160 0.207689 0.206289 0.242549 0.177432 0.211163 0.344646 0.266099 0.238117 0.249113 0.286177 0.227933 0.224191 0.226073 0.223956 0.230271 0.226635 0.330537
chargesum: 0.00000
title: Mulliken charges with hydrogens summed into heavy atoms:
elementType: O O C C C C C C C C C C C C C C C C
charge: -0.123105 -0.104154 0.022345 -0.059047 0.366984 0.390384 0.048142 0.060223 -0.094258 -0.149650 -0.181521 -0.120585 -0.000701 -0.011206 -0.015475 0.000726 -0.010993 -0.018108
polarizability: 1.90041714e+02 2.08070726e+01 1.75726963e+02 1.20871292e+01 1.19054925e+01 1.47454078e+02
1716.lowfreq: -9.1167 -4.9164 -0.0005 -0.0003 -0.0001 4.7463 22.6476 35.8969 46.6635
frequency: 22.1007 35.7239 46.6421 60.5583 64.3645 73.0754 126.0942 185.8383 195.7464 209.4243 251.5419 258.9025 286.6825 295.6393 319.0747 330.3255 350.0831 400.6255 402.8594 430.3188 459.4085 494.0117 546.1214 600.1099 615.9577 616.5632 635.8356 701.7179 704.4780 708.7907 764.2512 772.0427 782.5902 835.5888 854.0800 858.9952 884.0839 918.3312 931.6080 941.5076 961.6372 979.9089 981.9088 990.0685 990.6918 998.2739 999.1798 1023.4194 1027.7515 1039.5134 1055.4624 1069.2962 1078.2163 1090.1378 1102.3337 1138.2301 1154.1625 1171.6471 1172.7161 1189.1204 1193.0635 1200.4365 1238.9254 1274.6808 1284.7178 1307.3798 1317.6960 1321.7178 1344.6191 1361.1883 1380.6993 1381.6045 1385.1624 1433.9217 1434.9437 1459.0019 1468.6547 1480.4105 1481.4670 1486.4972 1589.7971 1592.1738 1609.0978 1612.7765 2936.6794 2961.1258 2984.8887 3022.4650 3050.2485 3072.4989 3117.7918 3124.0937 3126.6430 3132.9548 3140.2262 3146.5151 3154.0961 3158.4096 3166.0575 3177.4197 3557.6195 3562.7208
redmass: 3.8491 3.8050 5.6902 4.5770 1.8448 4.3464 3.6631 2.7554 4.4380 4.5137 4.2319 4.4309 3.0200 1.3765 1.4005 2.6170 3.0961 2.8096 2.8525 4.1639 3.7836 3.4958 4.0038 3.7723 6.4108 6.3672 5.4646 4.2476 1.6970 1.8234 1.7930 1.3163 1.8564 1.8131 1.2524 1.2555 2.2572 1.7137 1.4974 2.0304 4.8403 1.3855 1.4104 5.7678 5.8424 1.3180 1.3243 2.8059 2.2321 3.1105 2.9730 2.3576 1.6504 1.6112 1.9524 1.2532 1.9363 1.0586 1.0550 1.1485 1.1242 3.0512 1.3831 1.3052 1.1717 1.3887 1.3056 1.3302 1.4598 1.5638 6.6624 8.0020 1.2652 2.2037 2.2288 1.0991 1.0856 2.2375 2.0041 1.1351 6.0370 6.3259 6.0343 6.0315 1.0694 1.0609 1.0631 1.0969 1.0934 1.1011 1.0857 1.0846 1.0877 1.0879 1.0937 1.0921 1.0957 1.0989 1.1012 1.0954 1.0661 1.0659
irintensity: 0.0592 0.0872 1.2523 0.1024 3.6961 3.0212 2.3198 0.4832 4.4415 2.9785 3.0088 0.4539 29.1958 100.6859 90.0039 94.3459 27.5036 0.9852 0.8128 8.2774 8.7375 0.2229 6.1581 27.8838 0.2204 0.6892 23.7584 3.9132 60.0505 62.3889 55.4136 3.4707 33.5152 11.9051 0.2847 0.3112 10.7398 22.6191 2.1678 45.7776 52.9267 0.2954 0.5061 0.0733 0.4079 0.0463 2.7399 16.5687 18.8486 19.2717 7.6101 10.9235 4.1179 13.2163 8.0473 39.2584 31.9723 0.4068 0.2066 2.8262 2.8305 17.0790 28.9103 11.5843 6.4787 6.7918 4.4610 5.1036 17.3990 13.4048 2.6629 4.4764 34.5389 8.1413 21.6395 0.7442 0.9363 22.0441 6.7805 7.6361 1.7945 0.2475 6.5637 2.3849 61.7315 43.7257 22.8849 14.0976 12.4590 55.3938 5.1862 0.9825 3.0864 5.2524 32.7616 22.5924 29.4693 29.3487 17.8394 6.6643 7.0929 7.0276
temp: 298.150 k
press: 1.00000 atm
elementType: 8 8 6 6 6 6 6 6 6 6 6 6 6 6 6 6 6 6 1 1 1 1 1 1 1 1 1 1 1 1 1 1 1 1 1 1
symmnumber: 1
zpe: 780075.6 jmol-1
zpe.correction: 0.297115 hartree
zpe.thermalcorrener: 0.314269 hartree
zpe.thermalcorrenthalpy: 0.315213 hartree
zpe.thermalcorrgfe: 0.250477 hartree
zpe.sumelectzpe: -769.615730 hartree
zpe.sumelectthermal: -769.598576 hartree
zpe.sumelectthermalent: -769.597632 hartree
zpe.sumelectthermalfe: -769.662368 hartree
dipole: -2.7538 -0.7864 0.5771
dipole: 2.9215
quadrupole: -115.0359 -100.9961 -101.5532
quadrupole: 8.0088 8.0490 -2.1662
quadrupole: -9.1742 4.8656 4.3085 8.0088 8.0490 -2.1662
hfenergy: -769.9128451 hartree
pointgroup: C01 [X(C16H18O2)]
dipole: 1.109204 -0.2251076 -0.2002107 debye
polarizability: 192.3924029|-19.3138213|172.8568282|13.9618236|-11.2622207|147.9735242 unknown
InChI: InChI=1S/C16H18O2/c17-13-7-12-16(18,14-8-3-1-4-9-14)15-10-5-2-6-11-15/h1-6,8-11,17-18H,7,12-13H2
charge 0 multiplicity 1
36 atoms
O  -0.147866 -0.605128 -1.954661
O  -4.55164 -2.699499 0.036376
C  -0.000436 -0.465972 -0.476669
C  -0.855493 -1.57388 0.208894
C  1.502629 -0.566965 -0.135865
C  -0.549792 0.929414 -0.126091
C  -2.350098 -1.52162 -0.170912
C  -3.112223 -2.756319 0.340897
C  2.400403 0.289736 -0.82916
C  -0.384805 1.433252 1.188769
C  2.030046 -1.474088 0.815919
C  -1.246165 1.70842 -1.080072
C  3.786735 0.23791 -0.580297
C  -0.914355 2.691644 1.547333
C  3.421701 -1.526508 1.068388
C  -1.772003 2.971595 -0.722274
C  4.304635 -0.67317 0.372157
C  -1.612615 3.466976 0.591624
H  -0.43517 -2.562989 -0.071753
H  -0.758877 -1.4814 1.308528
H  -2.437291 -1.457273 -1.274754
H  -2.821666 -0.612909 0.24543
H  -2.661059 -3.685699 -0.074145
H  -3.072886 -2.816773 1.442585
H  0.388245 -1.390076 -2.234565
H  1.99454 0.996876 -1.560621
H  0.175013 0.849335 1.929635
H  1.367588 -2.147079 1.369279
H  -1.362048 1.320834 -2.095434
H  4.464044 0.906918 -1.123082
H  -0.776564 3.070108 2.566592
H  3.812812 -2.233529 1.80886
H  -2.307823 3.567074 -1.470485
H  5.381813 -0.713967 0.568949
H  -2.022062 4.445275 0.867647
H  -4.661565 -2.569924 -0.93982
