program: Gaussian 09
title: 000096660
version: EM64L-G09RevD.01
frameworkgroup: C1[X(C4H12P2S2)]
method: RPBEPBE
basis: SDD
operation: Freq
keyword: #p
keyword: freq=noraman
keyword: PBEPBE/SDD
title: #p freq=noraman PBEPBE/SDD
converged: YES YES NO NO
title: Mulliken charges:
elementType: S S P P C C C C H H H H H H H H H H H H
charge: -0.305496 -0.305496 0.325566 0.325566 -0.837252 -0.837268 -0.837267 -0.837253 0.274305 0.278224 0.274684 0.274572 0.278276 0.274389 0.278276 0.274388 0.274572 0.274305 0.278224 0.274684
chargesum: 0.00000
title: Mulliken charges with hydrogens summed into heavy atoms:
elementType: S S P P C C C C
charge: -0.305496 -0.305496 0.325566 0.325566 -0.010039 -0.010031 -0.010031 -0.010039
polarizability: 1.74752687e+02 2.11520947e+01 1.27933518e+02 8.86204884e-06 -1.61863938e-05 1.02445007e+02
1716.lowfreq: -8.0148 -0.0028 -0.0025 0.0006 11.2297 14.4366 19.4280 81.1430 105.4455
frequency: 11.2345 81.1430 105.4455 115.0134 120.9279 142.5520 158.4215 160.4559 174.1450 179.0486 189.9648 208.5806 234.0007 234.4906 237.6660 340.2588 482.2073 509.0390 667.0186 667.9869 698.0454 703.5957 882.8727 900.0336 915.4258 918.1868 950.1038 981.5265 998.2490 1003.2834 1316.6530 1320.9327 1333.3287 1336.2553 1426.5698 1429.3287 1434.4061 1438.3348 1440.9323 1441.2856 1445.7165 1453.9890 2999.4895 2999.7230 3000.3568 3000.6528 3117.1187 3117.3461 3118.3947 3118.5532 3136.1178 3137.0790 3137.1261 3138.0034
redmass: 4.3518 6.0296 2.9242 7.2248 1.0397 1.0577 1.0828 3.0298 1.0439 2.9815 3.9408 2.7705 3.4816 4.7639 3.2469 6.2492 9.2869 8.2238 6.3432 6.1384 5.1954 5.3566 1.1969 1.2838 1.2705 1.2230 1.3019 1.3785 1.3539 1.3723 1.1579 1.1546 1.1533 1.1506 1.0502 1.0485 1.0493 1.0448 1.0493 1.0436 1.0455 1.0437 1.0320 1.0319 1.0318 1.0318 1.1021 1.1019 1.1018 1.1019 1.1016 1.1017 1.1012 1.1017
irintensity: 8.1557 15.0935 2.3056 0.0000 0.0003 0.1858 0.4009 0.0001 0.0002 0.0000 5.5134 1.2090 0.0000 0.0000 16.4494 0.0000 67.7651 0.0000 0.0000 27.1160 0.0000 13.7823 9.0464 0.0000 12.2789 0.0002 168.1287 0.0000 0.0000 88.7761 0.0000 49.1415 31.1007 0.0001 21.1559 0.0013 0.0006 0.0000 3.9416 29.1064 32.7798 0.0001 7.8401 0.1726 10.1307 0.0351 0.0080 0.0782 0.0014 1.5453 0.0000 5.5597 3.3194 0.0002
temp: 298.150 k
press: 1.00000 atm
elementType: 16 16 15 15 6 6 6 6 1 1 1 1 1 1 1 1 1 1 1 1
symmnumber: 1
zpe: 405585.6 jmol-1
zpe.correction: 0.154479 hartree
zpe.thermalcorrener: 0.168648 hartree
zpe.thermalcorrenthalpy: 0.169592 hartree
zpe.thermalcorrgfe: 0.112089 hartree
zpe.sumelectzpe: -1637.552226 hartree
zpe.sumelectthermal: -1637.538057 hartree
zpe.sumelectthermalent: -1637.537113 hartree
zpe.sumelectthermalfe: -1637.594616 hartree
dipole: 0.0000 0.0000 0.0027
dipole: 0.0027
quadrupole: -102.7088 -75.6562 -75.9881
quadrupole: -13.8685 0.0000 0.0000
quadrupole: -17.9245 9.1282 8.7963 -13.8685 0.0000 0.0000
hfenergy: -1637.7067051 hartree
pointgroup: C01 [X(C4H12P2S2)]
dipole: 0.0000021 0.0010515 0. debye
dipolederiv: -0.6081833 -0.0000552 0.1519817 0.0000005 -0.433732 -0.0001263 0.2798091 0.0000443 -0.7503995 -0.6081827 0.0000216 0.1519815 -0.0000756 -0.433732 0.000215 0.2798096 0.0000328 -0.7503991 0.9883033 0.0000732 -0.2686283 -0.0000246 0.5701144 0.0001191 -0.0987411 0.0001753 1.0004679 0.9883034 -0.0000228 -0.2686289 0.0000237 0.5701141 -0.0002353 -0.0987426 -0.0003025 1.0004675 -0.3341431 -0.0495817 0.0466942 0.0316234 -0.2203563 -0.005715 -0.0618214 -0.0662781 -0.2723033 -0.333861 0.04982 0.0470674 -0.0316452 -0.2204603 0.0058667 -0.0618204 0.0660035 -0.2723118 -0.3338624 -0.0498242 0.0470495 0.031673 -0.2204346 -0.0058542 -0.0618148 -0.0659826 -0.272335 -0.3341415 0.0495779 0.046713 -0.0315953 -0.2203826 0.0057282 -0.0618264 0.0662985 -0.2722802 0.1071093 0.0485103 -0.0221453 0.0463482 -0.020808 0.0490113 -0.0065236 0.0542272 0.0651326 0.1049368 -0.0026028 0.063441 -0.0116126 0.0839168 -0.0249049 0.0308386 -0.0285178 -0.0312738 -0.0680443 -0.0103377 -0.02968 -0.0482759 0.0890188 -0.0005053 -0.0530081 -0.0287695 0.1134294 -0.0681349 0.0100456 -0.0302545 0.048078 0.0888627 0.0003962 -0.0534911 0.0287477 0.1131797 0.1048037 0.0022047 0.0636024 0.0112858 0.0840747 0.0251309 0.0310903 0.0289317 -0.030843 0.1072127 -0.0480356 -0.0220783 -0.0458622 -0.0206308 -0.0492327 -0.0063318 -0.0544747 0.0649218 0.1048034 -0.0022279 0.0635995 -0.0112985 0.084092 -0.0250976 0.0310827 -0.0288956 -0.0308621 0.1072197 0.0480334 -0.0220591 0.0458552 -0.0206727 0.0492063 -0.0063135 0.0544461 0.0649563 -0.0681395 -0.0100242 -0.0302562 -0.0480482 0.0888771 -0.0004018 -0.0535073 -0.0287509 0.1131712 0.1071021 -0.0485121 -0.0221649 -0.0463549 -0.0207656 -0.0490383 -0.0065419 -0.0542564 0.0650978 0.1049369 0.0025785 0.0634447 0.0115991 0.0839 0.0249381 0.0308465 0.0285547 -0.0312538 -0.0680387 0.0103589 -0.0296794 0.048306 0.0890043 0.0004996 -0.0529928 0.0287663 0.1134376 unknown
polarizability: 138.7991853|0.0030434|102.4450079|-28.949437|-0.0085802|163.8870176 unknown
InChI: InChI=1S/2C2H6PS/c2*1-3(2)4/h2*1-2H3
charge 0 multiplicity 1
20 atoms
S  1.614284 -0.607543 -2.283748
S  -1.614417 -0.608136 2.283588
P  1.184258 -0.607222 -0.226734
P  -1.18439 -0.607193 0.226574
C  1.75805 0.886844 0.749193
C  1.757751 -2.10152 0.749036
C  -1.758005 -2.101132 -0.749675
C  -1.758056 0.887233 -0.748874
H  1.481776 1.798958 0.198587
H  1.276224 0.879051 1.742397
H  2.854534 0.848611 0.854779
H  2.853807 -2.061335 0.858394
H  1.272742 -2.096142 1.740721
H  1.485103 -3.01323 0.195966
H  -1.273005 -2.095463 -1.741363
H  -1.485418 -3.013046 -0.196909
H  -2.854059 -2.060829 -0.859007
H  -1.481724 1.799142 -0.197959
H  -1.276212 0.879733 -1.742072
H  -2.854541 0.849118 -0.854493
