program: Gaussian 09
title: 000096652
version: EM64L-G09RevD.01
frameworkgroup: C1[X(C7H4ClN3O2)]
method: RPBEPBE
basis: SDD
operation: Freq
keyword: #p
keyword: freq=noraman
keyword: PBEPBE/SDD
title: #p freq=noraman PBEPBE/SDD
converged: NO YES NO NO
title: Mulliken charges:
elementType: Cl O O N N N C C C C C C C H H H H
charge: 0.039299 -0.206861 -0.204863 -0.307033 -0.048866 0.023856 0.395815 0.080866 -0.442187 -0.328679 0.413085 -0.265636 -0.362812 0.307442 0.259063 0.287910 0.359601
chargesum: 0.00000
title: Mulliken charges with hydrogens summed into heavy atoms:
elementType: Cl O O N N N C C C C C C C
charge: 0.039299 -0.206861 -0.204863 0.052568 -0.048866 0.023856 0.395815 0.080866 -0.134745 -0.069616 0.413085 -0.265636 -0.074903
polarizability: 1.92774661e+02 4.14964442e+00 1.23537927e+02 6.80719377e-03 2.71926522e-03 4.26202961e+01
1716.lowfreq: -3.8482 -0.0018 -0.0017 0.0010 1.2612 9.5759 58.6489 73.3153 134.0849
frequency: 58.6290 73.3125 134.0847 180.6069 220.0942 238.8411 329.1382 338.1071 421.2061 430.0801 451.2254 530.9609 567.3138 580.9671 607.6883 673.9887 698.5052 708.3506 752.5063 754.3978 808.4962 836.5002 910.7260 926.0435 986.7805 994.4688 1044.7900 1100.2790 1138.0271 1205.6220 1217.0955 1239.0321 1283.5437 1343.1203 1370.6181 1394.7853 1437.9583 1475.3845 1508.0184 1561.8738 1632.0243 3158.1295 3190.3272 3195.0341 3591.2514
redmass: 14.7099 9.5155 16.0870 6.3704 10.0876 5.3678 11.5348 8.3577 9.1677 2.9108 12.2986 6.3622 5.1775 6.5801 10.3090 8.6744 1.5997 2.3852 9.0669 4.1168 6.1457 1.5801 4.8305 1.4945 1.2983 8.7423 2.1716 5.7289 1.4193 8.6878 2.6218 1.8597 3.6319 3.1681 10.4513 3.0457 1.8450 7.4099 7.0322 7.2627 8.3829 1.0908 1.0931 1.0953 1.0825
irintensity: 0.0029 0.7912 0.7765 0.0000 1.4487 5.0551 0.0870 1.8300 7.6287 14.5134 6.7725 4.8517 0.1460 2.3651 0.0633 0.7944 25.8159 96.5963 43.0864 1.3599 1.7072 37.7133 8.2532 25.6743 0.8416 50.8201 26.0078 37.6743 4.3079 280.8297 60.7812 12.1354 10.3478 30.0709 92.6271 27.9140 53.2316 11.4378 51.3205 4.6801 4.4293 3.2430 6.1752 5.0120 151.9620
temp: 298.150 k
press: 1.00000 atm
elementType: 17 8 8 7 7 7 6 6 6 6 6 6 6 1 1 1 1
symmnumber: 1
zpe: 282916.4 jmol-1
zpe.correction: 0.107757 hartree
zpe.thermalcorrener: 0.117827 hartree
zpe.thermalcorrenthalpy: 0.118772 hartree
zpe.thermalcorrgfe: 0.070898 hartree
zpe.sumelectzpe: -1042.891028 hartree
zpe.sumelectthermal: -1042.880958 hartree
zpe.sumelectthermalent: -1042.880014 hartree
zpe.sumelectthermalfe: -1042.927888 hartree
dipole: 6.4802 -0.4063 0.0007
dipole: 6.4929
quadrupole: -91.8831 -79.1207 -81.4531
quadrupole: 4.1298 -0.0044 -0.0006
quadrupole: -7.7308 5.0316 2.6992 4.1298 -0.0044 -0.0006
hfenergy: -1042.9987854 hartree
pointgroup: C01 [X(C7H4Cl1N3O2)]
dipole: 2.5305616 -0.3490409 0.000291 debye
dipolederiv: -0.5579007 0.2518923 -0.0000114 0.3524526 -0.2587718 0.0000133 0.0000371 -0.0000178 0.0419943 -0.787256 -0.2210621 -0.0000035 -0.2085759 -0.6650552 0.0000818 -0.0001574 -0.0001687 -0.2295019 -0.7800832 0.1782457 -0.0000123 0.3219275 -0.6507439 -0.000106 -0.0001827 0.000154 -0.2265481 -0.7143073 -0.3081769 -0.0000164 -0.1961195 0.1112769 0.0000062 0.0001156 0.0000918 -0.1349256 -0.0047438 0.2499168 -0.0000224 -0.0245176 -0.3983673 0.0000336 -0.0000678 -0.00007 -0.181393 1.9728945 0.0905755 0.0001209 -0.1109703 1.0741045 0.0000214 0.0001757 0.0000205 0.1894257 -0.0773918 0.2052185 0.0000231 0.0870822 -0.1844743 0.0000067 0.000008 -0.0000046 0.0693154 -0.1613114 0.0612488 0.0000129 0.1251721 -0.0027377 -0.0000021 0.0000061 -0.000004 0.004592 0.4028998 -0.0152287 0.0000014 0.2974639 -0.0387964 0.0000206 0.0001205 0.0000216 -0.0757994 0.0305959 -0.1042253 -0.0000098 0.0839721 0.1028917 0.0000088 0.0000385 0.0000111 -0.1256672 -0.7685672 -0.1412778 -0.0000932 -0.2704199 0.1047984 0.0000027 0.0000013 -0.0000275 0.0468257 0.9587406 -0.4493541 0.000006 -0.4151058 0.4249315 -0.0000514 -0.0001009 0.0000094 -0.0942045 -0.0791893 0.1320443 0.0000009 -0.1657009 -0.0398357 -0.00002 0.0000427 0.0000183 -0.1372831 0.1128264 0.0153124 0.0000026 0.0192382 0.095219 -0.0000052 0.0000131 0.0000024 0.1786924 0.0535066 0.0630232 -0.0000055 0.0215521 -0.0190577 -0.0000059 -0.0000188 -0.000007 0.1647076 0.1030495 -0.0715133 0.0000038 -0.0117764 0.0729558 0.0000006 -0.0000062 -0.0000101 0.1766108 0.2962373 0.0633608 0.0000027 0.0943256 0.2716621 -0.0000052 -0.0000249 -0.0000193 0.3331589 unknown
polarizability: 193.0072071|-1.0318549|123.3053802|0.0069906|0.0022054|42.6202961 unknown
InChI: InChI=1S/C7H4ClN3O2/c8-7-5-2-1-4(11(12)13)3-6(5)9-10-7/h1-3,10H
charge 0 multiplicity 1
17 atoms
Cl 4.030943 -1.322897 0.000109
O  -3.687099 -1.067571 -0.000367
O  -3.494597 1.20556 -0.000292
N  2.814454 1.167337 0.000051
N  1.631178 1.885301 0.000189
N  -2.986295 0.018449 0.000108
C  1.26032 -0.4488 0.000072
C  0.670317 0.882195 0.000115
C  -0.73979 1.054615 0.000108
C  0.433395 -1.613029 0.000018
C  -1.505996 -0.113522 0.000071
C  2.648175 -0.201537 0.000114
C  -0.948283 -1.440836 0.00002
H  -1.209409 2.041024 0.000158
H  0.875759 -2.613891 0.000002
H  -1.635704 -2.289626 0.000011
H  3.698831 1.676128 0.000013
