program: Gaussian 09
title: 000096639
version: EM64L-G09RevD.01
frameworkgroup: C1[X(C9H11NO2)]
method: RPBEPBE
basis: SDD
operation: Freq
keyword: #p
keyword: freq=noraman
keyword: PBEPBE/SDD
title: #p freq=noraman PBEPBE/SDD
converged: YES YES NO NO
title: Mulliken charges:
elementType: O O N C C C C C C C C C H H H H H H H H H H H
charge: -0.483803 -0.257765 -0.455019 0.434918 0.506651 -0.615829 -0.409565 -0.372254 -0.421899 -0.207625 0.216858 -0.782470 0.278605 0.226809 0.309966 0.209013 0.209574 0.224463 0.306036 0.256703 0.257425 0.212867 0.356343
chargesum: 0.00000
title: Mulliken charges with hydrogens summed into heavy atoms:
elementType: O O N C C C C C C C C C
charge: -0.127460 -0.257765 -0.148983 0.434918 0.506651 -0.337225 -0.182756 -0.062288 -0.003312 0.016838 0.216858 -0.055475
polarizability: 1.67834350e+02 -5.98697627e+00 1.19631774e+02 -1.90633226e-01 -1.64660954e-01 5.45495998e+01
1716.lowfreq: -9.0898 -7.3850 -0.0011 -0.0010 -0.0010 1.9000 41.1434 43.9479 60.2144
frequency: 41.0823 43.8645 60.1943 94.4370 124.6516 189.4601 203.0885 248.9614 259.9293 329.6158 353.0487 418.0446 443.4570 519.5687 549.0023 564.0712 601.0157 651.5582 658.7117 705.4859 770.4876 797.0713 880.2198 897.0243 921.0151 966.1494 985.4512 989.2744 993.6696 1007.2753 1017.2293 1039.2151 1094.5296 1137.5790 1181.9184 1197.0742 1202.0805 1233.9345 1267.1262 1311.5410 1384.7979 1387.1385 1391.9711 1425.8481 1448.8858 1468.2124 1471.3403 1479.8765 1522.2816 1603.4228 1619.8654 1629.5754 2927.4906 2970.9694 2993.9123 3094.8039 3098.6014 3118.2995 3142.7726 3147.8570 3196.7834 3534.4561 3591.0927
redmass: 1.3712 2.3633 4.6578 2.7583 4.6194 2.2716 6.3392 1.3930 2.7118 4.3014 5.1703 5.2493 2.9146 4.0228 3.1181 4.9606 3.1663 5.9699 1.2513 2.1816 5.0676 1.4286 4.2713 1.3073 1.4418 3.4812 4.2104 7.3954 1.3192 1.9051 1.7825 1.6336 1.6552 1.3279 1.0887 1.5116 1.0719 2.0694 2.0245 1.5668 2.1475 1.8365 1.6672 2.5981 1.0458 1.1202 1.0802 2.6861 2.2452 6.3525 5.4370 5.4241 1.0547 1.1055 1.0362 1.1000 1.0985 1.0878 1.0913 1.0951 1.0951 1.0765 1.0666
irintensity: 2.5014 21.7602 0.3385 1.1915 5.1509 54.5971 5.8401 90.9666 34.2496 1.1335 5.6781 2.0156 3.3161 17.3248 7.9155 11.7770 0.8580 0.3077 65.3530 21.8757 2.7872 66.6550 4.4981 9.9574 21.9786 5.1951 5.1273 71.0684 3.9097 12.0912 3.0470 15.3361 5.3268 64.3316 2.3986 29.8173 1.3605 43.6147 3.6914 75.0736 157.7279 9.6324 3.2021 50.8256 15.2028 29.0854 8.6341 180.7875 215.3968 27.3493 186.6384 37.3863 58.3436 48.3013 13.8282 18.6239 10.6099 10.6304 10.7244 19.3489 6.1943 12.4191 5.9219
temp: 298.150 k
press: 1.00000 atm
elementType: 8 8 7 6 6 6 6 6 6 6 6 6 1 1 1 1 1 1 1 1 1 1 1
symmnumber: 1
zpe: 482091.3 jmol-1
zpe.correction: 0.183619 hartree
zpe.thermalcorrener: 0.195705 hartree
zpe.thermalcorrenthalpy: 0.196649 hartree
zpe.thermalcorrgfe: 0.144003 hartree
zpe.sumelectzpe: -553.874133 hartree
zpe.sumelectthermal: -553.862047 hartree
zpe.sumelectthermalent: -553.861103 hartree
zpe.sumelectthermalfe: -553.913748 hartree
dipole: -3.5156 -3.2122 0.1087
dipole: 4.7634
quadrupole: -56.6160 -64.5509 -74.3488
quadrupole: -8.4400 -0.2960 -0.2195
quadrupole: 8.5559 0.6210 -9.1769 -8.4400 -0.2960 -0.2195
hfenergy: -554.0577518 hartree
pointgroup: C01 [X(C9H11N1O2)]
dipole: -1.3673402 -1.2811846 -0.0321962 debye
dipolederiv: -0.2001139 -0.0194283 0.005347 -0.1714474 -0.8361756 -0.0123244 0.0004583 -0.0099452 -0.5925565 -0.8839575 -0.002465 -0.0312661 -0.5367991 -0.7898453 -0.0277051 -0.0302387 0.0043879 -0.3674308 -1.8078285 0.2136773 -0.092331 0.1297274 -0.3673491 0.0078409 -0.0926374 0.0132949 -0.3261439 0.3087118 0.0625874 0.0180647 0.1130201 0.0951106 0.0046939 0.011719 -0.0014555 -0.022659 0.945891 -0.3256477 0.0522531 -0.6193905 0.3057536 -0.0384458 0.0535542 -0.0209965 0.1066383 -0.4211486 0.0790998 -0.0131075 -0.0190556 -0.0155601 -0.0024006 -0.0087467 0.0069881 -0.2020607 -0.1617533 -0.0856793 0.0038917 -0.1075067 -0.1259705 -0.0063334 0.0029942 -0.0059064 -0.2161666 -0.2005755 0.038981 -0.0016943 0.2242419 -0.2012421 0.0140151 -0.00327 0.0025389 -0.1801969 0.1876055 -0.0061691 -0.0079735 0.1447239 0.7054351 0.0086415 -0.0032334 0.0032012 0.4240192 0.1031981 0.0095326 0.0142049 -0.0418321 0.1748968 -0.0053259 0.0151964 -0.0019946 -0.1341478 2.0138435 -0.0968933 0.1141654 0.6044533 0.9577604 0.0274406 0.1170618 -0.017918 0.1985819 -0.2862456 0.252289 -0.020031 0.229582 -0.1532936 0.019458 -0.0298705 0.0271188 0.0046883 0.1534645 0.0790875 -0.0019773 0.0622508 -0.0327642 0.0054289 -0.0003172 0.0067552 0.1720736 -0.0944919 0.1025007 -0.0161904 0.0871941 0.0472122 0.0059839 -0.0164524 0.007002 0.1606527 0.1068361 -0.0738854 -0.0039189 -0.0503728 0.1088046 -0.0024621 -0.0040053 -0.0037689 0.1855466 -0.0768174 0.0211086 0.1007619 -0.0120946 -0.0699585 -0.0557009 0.148339 -0.0523531 -0.0754686 -0.051673 0.0189621 -0.0986253 -0.0075388 -0.0709331 0.05578 -0.1446264 0.0561514 -0.0958597 0.0752495 -0.006146 -0.0044656 0.0112911 -0.1312197 0.0030045 -0.0045808 0.0019011 0.1501673 0.17019 -0.0387711 -0.0076985 0.0093334 0.0937754 0.0019022 -0.007621 -0.0010813 0.3020201 0.0600686 0.0057052 -0.0792865 0.0127993 0.0797421 -0.0361498 -0.1188519 0.0048774 -0.0300203 0.0256492 0.0034243 0.0902914 0.0012652 0.0799643 0.0397431 0.1311863 -0.0039124 0.0094464 0.017204 -0.1199696 -0.0104631 -0.0249 -0.127998 -0.0061421 -0.0077162 -0.0132339 0.1157626 0.0166933 -0.1119007 -0.0099512 -0.0389449 0.2738548 -0.0009425 -0.0083414 -0.001651 0.4131139 unknown
polarizability: 167.5792347|-5.3195202|119.4806523|6.736877|-0.9132651|54.9558368 unknown
InChI: InChI=1S/C9H11NO2/c1-7(12)10-9-4-2-3-8(5-9)6-11/h2-5,10-11H,6H2,1H3
charge 0 multiplicity 1
23 atoms
O  -3.108576 -2.159481 -0.268624
O  3.279275 0.859689 0.114572
N  1.588369 -0.770102 0.02325
C  -2.047343 0.026688 -0.197607
C  0.405165 0.023551 -0.052879
C  -0.830421 -0.67511 -0.120522
C  -2.035686 1.445174 -0.208278
C  0.42208 1.442057 -0.062627
C  -3.371864 -0.716057 -0.266269
C  -0.806725 2.13441 -0.140706
C  2.91843 -0.3549 0.101981
C  3.936223 -1.493011 0.179814
H  -0.864286 -1.770257 -0.115098
H  -2.977603 2.004448 -0.26891
H  1.375058 1.970598 -0.010551
H  -3.998637 -0.432184 0.607637
H  -3.916326 -0.414285 -1.187783
H  -0.798062 3.230136 -0.149027
H  1.429522 -1.77999 0.020566
H  4.500674 -1.403677 1.124247
H  4.660818 -1.38078 -0.644773
H  3.490437 -2.501708 0.127102
H  -3.964622 -2.653408 -0.287313
