program: Gaussian 09
title: 000096635
version: EM64L-G09RevD.01
frameworkgroup: C1[X(C8H8Br2O3S)]
method: RPBEPBE
basis: SDD
operation: Freq
keyword: #p
keyword: freq=noraman
keyword: PBEPBE/SDD
title: #p freq=noraman PBEPBE/SDD
converged: YES YES NO NO
title: Mulliken charges:
elementType: Br Br S O O O C C C C C C C C H H H H H H H H
charge: 0.008995 -0.001819 0.954089 -0.570289 -0.495027 -0.473032 -0.227779 0.567234 0.542690 -0.383722 -0.280196 -0.341539 -0.842894 -0.857591 0.302254 0.258669 0.251055 0.318642 0.296567 0.292345 0.295983 0.385365
chargesum: 0.00000
title: Mulliken charges with hydrogens summed into heavy atoms:
elementType: Br Br S O O O C C C C C C C C
charge: 0.008995 -0.001819 0.954089 -0.184924 -0.495027 -0.473032 -0.227779 0.567234 0.542690 -0.081468 -0.021527 -0.090484 -0.227685 -0.269263
polarizability: 2.09607643e+02 1.36518729e+00 1.51298402e+02 2.15127225e-01 5.95766470e-01 1.17843963e+02
1716.lowfreq: -9.3896 -2.5843 -0.0010 0.0010 0.0017 3.2702 24.8738 28.1326 33.6399
frequency: 24.8267 28.1232 33.5861 37.8762 98.2268 107.5897 138.1093 151.7981 189.9572 220.1085 234.3375 260.7114 293.8476 314.3576 327.8313 339.5545 408.4019 434.7621 441.3374 473.5014 520.1765 542.6781 575.3957 642.2387 662.0270 732.8846 766.4270 831.3578 851.7633 858.7121 872.3433 884.6539 924.7546 964.5261 982.8099 1014.7274 1047.3172 1088.5419 1116.0537 1167.5449 1212.1960 1214.1395 1220.8740 1235.5697 1287.0029 1375.0058 1407.5247 1459.8837 1467.0892 1489.6066 1554.9155 1615.9799 3069.7834 3078.1153 3138.4121 3143.4513 3153.4024 3159.0658 3168.2751 3479.7624
redmass: 9.8508 10.7094 21.0031 10.8444 6.5624 7.0134 6.6426 8.9604 2.6952 4.3951 5.0261 2.4131 2.9032 3.5370 7.8938 5.2104 5.2016 4.0732 4.2698 5.4826 7.0580 11.1202 6.2181 3.6534 7.0632 3.9905 4.4604 11.0133 1.6553 2.2331 1.9908 1.5333 1.4586 13.3196 1.3943 2.9363 1.1979 1.2864 1.0827 1.1752 1.3007 1.1634 1.5607 5.2011 1.3844 3.7462 4.0246 1.1210 1.1138 3.0885 6.6947 7.0281 1.0576 1.0592 1.0883 1.0928 1.1108 1.0975 1.1090 1.0662
irintensity: 0.7626 0.4309 0.1041 0.1696 2.2503 2.2403 0.8239 2.6866 15.9135 15.3183 8.1001 27.8200 13.1227 79.2269 7.5230 13.6902 27.1053 3.6210 52.5823 2.6579 13.1926 151.1474 49.0560 27.4262 5.0537 8.1665 29.1143 44.7409 20.6084 14.7925 8.1869 0.4692 14.3173 93.5106 0.1445 6.5077 71.4504 8.8306 1.7089 2.8901 40.1502 28.9617 31.0179 2.9359 0.5849 8.2733 9.9313 6.9546 9.9120 7.3824 1.7761 0.9305 11.4952 5.7189 4.0770 8.4477 0.4012 8.2951 0.9210 48.7633
temp: 298.150 k
press: 1.00000 atm
elementType: 35 35 16 8 8 8 6 6 6 6 6 6 6 6 1 1 1 1 1 1 1 1
symmnumber: 1
zpe: 380028.7 jmol-1
zpe.correction: 0.144745 hartree
zpe.thermalcorrener: 0.160338 hartree
zpe.thermalcorrenthalpy: 0.161282 hartree
zpe.thermalcorrgfe: 0.097383 hartree
zpe.sumelectzpe: -959.082658 hartree
zpe.sumelectthermal: -959.067066 hartree
zpe.sumelectthermalent: -959.066121 hartree
zpe.sumelectthermalfe: -959.130020 hartree
dipole: 1.1236 -0.6990 5.5124
dipole: 5.6690
quadrupole: -112.0089 -108.9180 -109.6030
quadrupole: -3.4817 -1.4394 1.2061
quadrupole: -1.8323 1.2586 0.5736 -3.4817 -1.4394 1.2061
hfenergy: -959.2274035 hartree
pointgroup: C01 [X(C8H8Br2O3S1)]
dipole: -0.7986067 0.7257975 1.9519201 debye
dipolederiv: -0.2911688 -0.1459531 0.0473534 -0.2450987 -0.3113454 0.1446056 0.2830508 0.2600888 -0.2892461 -0.5280822 -0.1106721 -0.1544083 -0.0457806 -0.1228155 0.008467 -0.5110624 -0.1137816 -0.3922186 1.5974424 -0.2940863 0.133595 -0.3027069 1.5470587 -0.0851067 0.1384909 -0.0170855 1.4935597 -0.6221537 -0.0364808 -0.2707114 -0.018474 -0.5160843 0.1205079 -0.3092108 0.1416561 -0.9235202 -0.5848769 0.0318068 -0.0414268 0.0477574 -0.7077808 -0.042232 0.0081304 -0.005966 -0.441385 -0.6484069 0.0608414 0.1009218 0.0786477 -0.5704938 0.0693897 0.0495092 -0.0151338 -0.4950815 0.039566 -0.1233612 0.0181889 -0.0792809 -0.0328014 -0.027396 0.1621669 -0.013305 -0.1239872 -0.1504076 0.2785861 -0.0845477 -0.1039026 0.0026357 0.0323906 -0.1438263 -0.0404367 -0.0513601 0.0287574 0.0852185 0.0166648 -0.1453099 -0.07663 0.0509155 0.1076235 0.0758742 -0.0933173 -0.2274491 -0.1307492 0.0229056 0.2259642 -0.1679129 -0.0088748 -0.0253567 -0.0086189 -0.0698207 -0.2162992 -0.0715735 0.022229 0.1173397 0.0776901 0.0510196 -0.0004193 -0.0043216 -0.081778 0.0793327 -0.1043314 -0.0591779 -0.0272084 0.039568 0.0263219 -0.0019719 -0.0037249 -0.0973001 0.3383393 0.231175 -0.1199828 0.2370623 0.3401484 -0.236103 -0.2584399 -0.3243092 0.4637611 0.6846976 0.1460199 0.2904318 0.1649458 0.1101394 0.002988 0.5217906 0.0557807 0.5852559 0.1580944 -0.0222283 0.0202715 -0.0567965 0.0737433 -0.0208608 -0.0123224 -0.0154429 0.1381844 0.05797 -0.0134632 -0.0165168 -0.0199135 -0.0538451 -0.0247881 0.0124101 -0.0170508 0.1364753 -0.0285784 0.0773616 0.0290571 0.0730893 0.05629 -0.0066637 0.0110324 -0.0126376 0.1328345 0.0393115 -0.0255451 0.0323385 0.061879 0.0547908 0.0637185 0.0298676 0.1037437 -0.0034379 0.0589579 -0.0073202 0.0482962 -0.0658899 -0.0089743 -0.003962 0.0463795 -0.0044438 -0.0728931 -0.0342925 -0.0006964 -0.0198432 0.0559394 0.0578905 -0.0653636 -0.0218647 -0.0534068 -0.0744811 0.0382638 0.043883 -0.0724774 -0.0368328 -0.0297176 0.0466469 -0.0861002 0.0451421 -0.0175928 0.2109821 0.1315684 0.0568387 0.0845698 0.2384464 -0.0956206 0.000123 -0.0326205 0.277349 unknown
polarizability: 204.1968011|16.9363186|153.0430613|8.1212524|-8.046272|121.5101448 unknown
InChI: InChI=1S/C8H8Br2O3S/c9-4-6-1-2-7(5-10)8(3-6)14(11,12)13/h1-3,11H,4-5H2
charge 0 multiplicity 1
22 atoms
Br 2.240013 2.797038 -1.326959
Br -4.385036 -0.490438 -1.514854
S  1.679405 -1.48256 -0.001449
O  2.290952 -1.282218 1.748422
O  1.060256 -2.96352 -0.198337
O  2.852566 -0.965116 -0.985988
C  0.26155 -0.245862 0.198112
C  0.508377 1.13598 0.364413
C  -2.146851 0.001039 0.343598
C  -1.012184 -0.831286 0.184078
C  -0.650751 1.945383 0.52994
C  -1.944423 1.395747 0.520248
C  1.872724 1.765892 0.400402
C  -3.524494 -0.588578 0.349011
H  -1.113503 -1.914115 0.048633
H  -0.514376 3.025209 0.654545
H  -2.813214 2.05236 0.641611
H  2.701488 1.05147 0.472764
H  1.945351 2.53406 1.183056
H  -4.229176 -0.035508 0.986075
H  -3.537933 -1.660591 0.589176
H  3.07526 -1.893587 1.867499
