program: Gaussian 09
title: 000096632
version: EM64L-G09RevD.01
frameworkgroup: C1[X(C8H15O4P)]
method: RPBEPBE
basis: SDD
operation: Freq
keyword: #p
keyword: freq=noraman
keyword: PBEPBE/SDD
title: #p freq=noraman PBEPBE/SDD
converged: YES YES NO NO
title: Mulliken charges:
elementType: P O O O O C C C C C C C C H H H H H H H H H H H H H H H
charge: 1.236159 -0.501585 -0.527007 -0.163189 -0.621796 -0.284686 -0.456027 -0.454255 -0.087367 -0.221350 -0.215773 -0.658159 -0.653632 0.311153 0.258517 0.265717 0.265856 0.257741 0.236027 0.222797 0.239489 0.213616 0.206488 0.228892 0.233340 0.208929 0.229265 0.230841
chargesum: 0.00000
title: Mulliken charges with hydrogens summed into heavy atoms:
elementType: P O O O O C C C C C C C C
charge: 1.236159 -0.501585 -0.527007 -0.163189 -0.621796 0.026467 0.068207 0.069341 -0.087367 0.237474 0.237331 0.010560 0.015403
polarizability: 1.55933430e+02 -2.52363489e+00 1.24671909e+02 1.86781198e+00 -5.30160836e+00 1.07331701e+02
1716.lowfreq: -13.2588 0.0008 0.0022 0.0028 8.7236 13.2162 15.6293 21.6680 35.3512
frequency: 12.4632 20.2946 34.9188 53.2347 58.2332 66.6127 85.9176 115.0892 142.1953 173.1441 209.2599 235.9229 236.1812 239.8145 241.8330 274.7973 287.3955 298.0649 373.9055 423.7563 491.2168 614.9262 625.4242 682.5817 702.3265 762.7392 800.0051 804.7960 805.1898 831.3694 867.9499 869.2823 882.1221 992.9865 1012.5530 1019.8264 1032.9415 1058.3287 1084.4830 1099.9682 1102.0984 1104.0187 1105.2309 1131.7252 1132.5581 1183.2365 1197.8904 1250.0768 1252.3060 1354.8674 1356.8109 1376.2567 1393.3124 1395.3922 1433.0012 1453.9697 1456.6360 1457.9222 1477.4398 1479.1194 1489.8673 1492.7870 1626.1691 2987.3421 2991.7387 2994.3722 2998.9412 3050.0089 3060.5890 3089.1550 3090.2259 3105.9708 3107.8637 3108.8483 3112.2989 3163.3729 3212.9280 3231.5492
redmass: 2.5263 2.9097 2.2905 2.4856 2.6997 3.9795 4.6540 5.2169 5.5161 5.5461 3.9646 2.0542 2.2196 2.7531 1.2498 3.0380 5.8821 4.9562 4.8419 7.1546 10.6116 6.0120 6.4281 6.5931 2.5875 5.5130 1.2852 1.0907 1.0912 3.2274 4.2740 3.8687 1.1917 3.0297 2.6864 2.8703 7.7408 1.1876 1.2110 1.5716 2.1050 1.3072 2.0260 1.4289 1.4293 1.3926 2.0392 1.1454 1.1455 1.2550 1.2437 1.7900 1.2447 1.2472 1.0870 1.2995 1.0403 1.0405 1.0517 1.0477 1.0811 1.0845 9.3914 1.0539 1.0368 1.0391 1.0560 1.1077 1.1079 1.0978 1.0981 1.0500 1.1020 1.1023 1.0616 1.0925 1.1188 1.1164
irintensity: 0.2148 1.0552 3.4218 2.1657 0.7468 3.5571 0.7522 3.6184 1.3924 20.3357 3.7887 10.8824 0.6042 15.3569 0.4104 9.8759 7.5198 3.6858 10.5788 10.5206 60.6738 72.9194 45.2556 94.3508 2.1521 6.7176 4.5885 1.7566 3.8169 7.1124 165.6991 198.0927 9.9296 183.1090 148.2678 122.1256 59.1009 34.4299 14.6334 4.2099 4.5747 1.4291 20.7469 5.0555 4.8044 0.9428 9.9289 0.2129 1.9974 9.3447 5.3406 107.0922 23.2539 27.6709 13.2017 17.4543 11.1001 12.7823 7.0876 3.5558 18.5848 1.1434 89.7763 30.9504 22.6216 27.1051 24.9811 12.7415 10.4255 27.1520 31.4093 9.5110 33.9564 40.2614 5.3560 3.1079 0.1404 5.2632
temp: 298.150 k
press: 1.00000 atm
elementType: 15 8 8 8 8 6 6 6 6 6 6 6 6 1 1 1 1 1 1 1 1 1 1 1 1 1 1 1
symmnumber: 1
zpe: 583968.7 jmol-1
zpe.correction: 0.222422 hartree
zpe.thermalcorrener: 0.239425 hartree
zpe.thermalcorrenthalpy: 0.240369 hartree
zpe.thermalcorrgfe: 0.173870 hartree
zpe.sumelectzpe: -954.866804 hartree
zpe.sumelectthermal: -954.849801 hartree
zpe.sumelectthermalent: -954.848857 hartree
zpe.sumelectthermalfe: -954.915356 hartree
dipole: 0.8058 -0.6948 -2.1348
dipole: 2.3853
quadrupole: -65.8854 -79.0483 -98.5775
quadrupole: -0.0988 4.6593 -0.1788
quadrupole: 15.2850 2.1221 -17.4071 -0.0988 4.6593 -0.1788
hfenergy: -955.0892262 hartree
pointgroup: C01 [X(C8H15O4P1)]
dipole: -0.2070749 -0.2978194 0.865509 debye
polarizability: 151.5963642|11.1140103|129.6509827|-1.2334041|3.9199421|106.6896925 unknown
InChI: InChI=1S/C8H15O4P/c1-3-11-13(10,12-4-2)8(9)7-5-6-7/h7H,3-6H2,1-2H3
charge 0 multiplicity 1
28 atoms
P  0.326465 0.246139 -0.82834
O  0.707008 1.939659 -0.956233
O  1.491255 -0.409741 0.297787
O  -1.406218 0.752398 1.308702
O  0.274383 -0.460773 -2.256784
C  -2.323572 -0.763813 -0.362781
C  -3.819017 -0.375478 -0.131717
C  -3.249144 -1.558908 0.611237
C  -1.301109 0.109035 0.239105
C  1.057401 2.737909 0.263003
C  2.758336 -0.980231 -0.255457
C  1.604877 4.066587 -0.24986
C  3.412103 -1.75725 0.883333
H  -2.053652 -1.224855 -1.31612
H  -4.489361 -0.54544 -0.977857
H  -3.984103 0.547378 0.431219
H  -3.029072 -1.434344 1.675222
H  -3.515849 -2.570124 0.294014
H  0.144984 2.87036 0.872955
H  1.804853 2.180211 0.857901
H  2.514374 -1.628665 -1.118104
H  3.400072 -0.149167 -0.606354
H  1.870225 4.718584 0.603491
H  2.506104 3.906902 -0.86583
H  0.850603 4.585193 -0.865538
H  4.370423 -2.190618 0.541211
H  3.614122 -1.095677 1.742907
H  2.756609 -2.577572 1.221386
