program: Gaussian 09
title: 000010731
version: EM64L-G09RevD.01
frameworkgroup: C1[X(C14H10O)]
method: RPBEPBE
basis: SDD
operation: Freq
keyword: #pfreq=noraman
keyword: PBEPBE/SDD
title: #p freq=noraman PBEPBE/SDD
converged: YES YES NO NO
title: Mulliken charges:
elementType: O C C C C C C C C C C C C C C H H H H H H H H H H
charge: -0.426235 0.192598 0.239112 0.489408 0.461349 -0.049495 -0.778107 -0.371647 -0.342067 -0.443838 -0.443798 -0.237707 -0.272377 -0.238099 -0.244855 0.244644 0.276315 0.183530 0.242966 0.244864 0.228766 0.229484 0.226566 0.230042 0.358580
chargesum: 0.00000
title: Mulliken charges with hydrogens summed into heavy atoms:
elementType: O C C C C C C C C C C C C C C
charge: -0.067655 0.192598 0.239112 0.489408 0.461349 -0.049495 -0.533463 -0.095332 -0.158537 -0.200872 -0.198935 -0.008941 -0.042893 -0.011533 -0.014813
polarizability: 2.83636487e+02 -1.12162380e+00 1.64258671e+02 1.12355036e-02 2.86841429e-02 5.83996181e+01
1716.lowfreq: -8.8487 -6.6380 -0.0009 0.0003 0.0004 6.4437 79.0224 105.7045 149.9692
frequency: 79.0209 105.7022 149.9682 229.9107 235.4586 274.5346 302.8280 306.2503 386.5290 401.1778 417.7204 472.4648 501.3516 520.4640 560.6134 565.8805 606.8433 621.3107 638.8836 685.5758 736.2001 744.1431 764.9288 807.0779 840.1615 843.1955 857.8230 867.2065 906.4078 916.8909 949.0947 973.5125 985.6589 994.4875 1017.6467 1021.6178 1059.7401 1104.4368 1152.4270 1169.5964 1175.4499 1186.3076 1207.6301 1246.4426 1276.2357 1292.4268 1354.1067 1379.1965 1396.2536 1424.4177 1443.8385 1444.3544 1449.9225 1488.4353 1550.5348 1567.3401 1582.2132 1629.1501 1637.2675 3083.4882 3121.5670 3124.2236 3128.7260 3136.9356 3142.9271 3155.1492 3163.1885 3174.9135 3593.0596
redmass: 4.1081 3.4285 3.7070 4.7444 4.0511 1.3581 4.1199 5.2537 6.8382 3.0841 5.8079 2.6774 3.4795 7.7460 5.4083 2.9100 6.6297 3.8211 6.1763 6.0179 1.3353 3.2577 1.3211 2.1764 1.4688 3.9457 5.8239 1.4841 4.9914 2.0286 1.4291 1.3792 1.3684 1.3310 2.2262 2.4267 5.5384 2.1872 1.3569 1.1342 1.1434 1.2868 1.3139 1.5986 2.0100 2.0073 4.4015 1.6466 2.9739 4.7760 7.8494 2.8307 2.4886 2.8760 5.9954 7.7749 5.4744 6.1891 6.8092 1.0878 1.0861 1.0872 1.0908 1.0902 1.0933 1.0962 1.0998 1.0975 1.0653
irintensity: 0.0421 5.2064 6.5413 1.7362 7.3283 89.0318 0.0009 7.2127 0.2440 17.2041 1.7648 5.1926 0.0030 1.2182 5.7290 22.6442 6.2010 16.0432 1.3103 2.1082 99.9928 6.8684 11.7783 15.7816 27.6610 12.4682 2.3386 13.9948 13.3406 21.6015 6.9484 6.5861 3.2317 0.0017 11.4064 11.9452 94.5569 1.2025 40.5017 4.5544 31.9796 14.8087 65.7366 2.1904 19.9490 1.7708 84.3846 1.2952 1.6421 32.6291 11.0922 3.8986 4.8556 15.9190 6.8778 19.8088 4.3965 11.8761 9.7215 19.6921 0.1066 0.0102 5.3749 19.2369 28.7656 33.0572 35.6493 18.6743 27.8591
temp: 298.150 k
press: 1.00000 atm
elementType: 8 6 6 6 6 6 6 6 6 6 6 6 6 6 6 1 1 1 1 1 1 1 1 1 1
symmnumber: 1
zpe: 510389.4 jmol-1
zpe.correction: 0.194397 hartree
zpe.thermalcorrener: 0.205412 hartree
zpe.thermalcorrenthalpy: 0.206356 hartree
zpe.thermalcorrgfe: 0.157892 hartree
zpe.sumelectzpe: -613.715791 hartree
zpe.sumelectthermal: -613.704776 hartree
zpe.sumelectthermalent: -613.703832 hartree
zpe.sumelectthermalfe: -613.752296 hartree
dipole: -1.4409 0.0039 -0.0006
dipole: 1.4409
quadrupole: -72.6501 -74.5718 -94.1266
quadrupole: -4.5940 -0.0002 0.0050
quadrupole: 7.7994 5.8777 -13.6771 -4.5940 -0.0002 0.0050
hfenergy: -613.9101878 hartree
pointgroup: C01 [X(C14H10O1)]
dipole: 0.5668823 0.0021997 0.0011758 debye
dipolederiv: -0.1075722 -0.0144444 0.0008759 -0.0214627 -1.3959516 -0.0260112 0.0009175 -0.0246866 -0.3901826 0.0679154 -0.2691086 -0.0066469 0.0911205 -0.2559269 -0.006007 0.0026405 -0.0067473 -0.0145581 0.0252733 0.2848944 0.0067416 -0.2380986 -0.2938844 -0.0072319 -0.0074441 -0.0057747 -0.0163285 0.2897251 -0.0086075 0.0001865 -0.1395413 -0.0297324 -0.0026051 -0.0026055 -0.0023086 0.0724084 0.2300321 -0.0113854 0.000355 0.3007481 -0.0366116 -0.0019607 0.008545 -0.0025285 0.077218 0.0452143 0.0166427 0.0001913 0.05603 1.3404778 0.0338018 0.00104 0.0326192 0.044427 -0.362422 0.0159794 0.0002917 -0.0175568 0.0842673 0.0074782 -0.0003208 0.0076669 -0.2495347 -0.0427069 0.0988645 0.0027286 -0.1180185 0.0271475 0.0039623 -0.0028739 0.0041155 -0.1400293 -0.00328 -0.0440856 -0.0006053 0.116965 0.0450042 0.0039568 0.003379 0.0029038 -0.1705057 -0.1276094 0.0178548 0.000622 0.0928696 0.1173631 0.0075716 0.0022183 0.0075047 -0.1833276 -0.0270306 0.0264535 0.000845 -0.0970671 0.1263476 0.0068353 -0.0023097 0.0071735 -0.1695597 -0.0092869 -0.1952577 -0.0044429 -0.0420211 -0.0007531 0.0041444 -0.000613 0.0038334 -0.1751691 -0.0452337 0.1510936 0.0030008 0.0473335 0.0449861 0.0043717 -0.0001908 0.0045695 -0.1638277 0.031923 0.1242368 0.0035375 0.0367544 0.1093374 0.0067479 0.0014972 0.0069322 -0.1569197 -0.0202313 -0.1467451 -0.0030116 -0.0481869 0.0571856 0.0050792 -0.0000712 0.0048035 -0.1686491 0.0534857 0.0027999 -0.0001715 0.0021502 -0.0895 -0.005925 -0.0004231 -0.0058867 0.1648236 0.0950526 -0.0179203 -0.0005457 0.0477814 -0.0277673 -0.0046432 0.0011063 -0.0047526 0.1628182 0.0724146 0.0564957 0.0011894 -0.0421503 -0.166608 -0.0068322 -0.0007133 -0.0062803 0.1538431 0.0716591 0.045721 0.0009213 -0.0480057 -0.1057599 -0.0065674 -0.0014041 -0.0064019 0.1567189 0.0745158 -0.0449659 -0.0011871 0.046918 -0.1003283 -0.0058233 0.0007196 -0.0059921 0.1548534 -0.1050035 0.0938527 0.001751 0.1020385 0.0318389 -0.0029968 0.0018939 -0.0029694 0.1611915 -0.0925383 -0.0922033 -0.0021045 -0.1035669 0.0317724 -0.0028708 -0.0018395 -0.0027594 0.1638687 -0.1047525 -0.1029636 -0.0031401 -0.108108 0.0332226 -0.0033939 -0.0032888 -0.003398 0.1606812 -0.0962358 0.0986647 0.0018372 0.1027226 0.0332987 -0.0027909 0.0018357 -0.0028383 0.1649384 0.0866921 -0.0858663 -0.003219 -0.019648 0.4205742 0.0017101 -0.0016953 0.0012022 0.3608015 unknown
polarizability: 283.6329279|1.2613072|164.1999155|0.391534|2.5558918|58.4619331 unknown
InChI: InChI=1S/C14H10O/c15-14-12-7-3-1-5-10(12)9-11-6-2-4-8-13(11)14/h1-9,15H
charge 0 multiplicity 1
25 atoms
O  -0.097791 2.635458 0.089782
C  -1.249875 0.538548 0.034151
C  1.242477 0.549446 0.037908
C  -1.235374 -0.917378 -0.001666
C  1.231443 -0.910595 0.003237
C  -0.008827 1.234449 0.053881
C  0.001004 -1.608965 -0.0156
C  -2.509443 1.232762 0.048947
C  2.513565 1.228483 0.053442
C  -2.498041 -1.612182 -0.021343
C  2.494162 -1.606414 -0.010841
C  -3.707449 0.523502 0.02877
C  3.711408 0.519623 0.038693
C  -3.701614 -0.914015 -0.006899
C  3.701721 -0.917452 0.006626
H  0.005695 -2.70507 -0.041101
H  -2.500695 2.32576 0.076182
H  2.566726 2.326392 0.075572
H  -2.491181 -2.708314 -0.04834
H  2.481656 -2.702511 -0.036222
H  -4.66318 1.058731 0.039918
H  4.666855 1.054778 0.050272
H  -4.653367 -1.4567 -0.02255
H  4.651362 -1.46303 -0.004148
H  0.797465 3.053393 0.103932
