program: Gaussian 09
title: 000096626
version: EM64L-G09RevD.01
frameworkgroup: C1[X(C13H20O)]
method: RPBEPBE
basis: SDD
operation: Freq
keyword: #pfreq=noraman
keyword: PBEPBE/SDD
title: #p freq=noraman PBEPBE/SDD
converged: YES YES NO NO
title: Mulliken charges:
elementType: O C C C C C C C C C C C C C H H H H H H H H H H H H H H H H H H H H
charge: -0.422339 -0.212257 -0.238351 0.459973 0.451405 -0.193128 -0.631515 -0.568515 0.454885 -0.684940 -0.684547 -0.702242 -0.701827 -0.832632 0.153402 0.262428 0.233386 0.236277 0.229121 0.211723 0.218684 0.219432 0.211765 0.228784 0.207537 0.209967 0.227008 0.227107 0.209878 0.207486 0.224372 0.220922 0.229935 0.336817
chargesum: 0.00000
title: Mulliken charges with hydrogens summed into heavy atoms:
elementType: O C C C C C C C C C C C C C
charge: -0.085522 -0.058855 0.024077 0.459973 0.451405 -0.193128 -0.398129 -0.332238 0.454885 -0.025413 -0.024566 -0.057729 -0.057357 -0.157402
polarizability: 1.79407187e+02 1.14813376e+00 1.54463846e+02 2.92274611e-02 2.53278690e-01 1.02950485e+02
1716.lowfreq: -11.4962 -6.1122 -3.1248 -0.0005 0.0003 0.0007 26.2449 30.2776 33.0058
frequency: 25.3133 29.6061 32.8110 73.6027 125.7781 133.5507 155.2780 187.4331 215.1914 218.2071 240.2131 246.2625 254.8757 283.4819 284.0213 313.9106 329.5656 341.0841 412.6603 422.2648 429.8927 459.8957 534.0369 576.3675 579.3751 596.1024 619.0663 756.6692 776.1535 809.1758 872.1296 879.3270 907.7920 914.4984 921.3687 932.8758 947.1774 954.6764 955.0959 1001.0128 1048.0790 1074.7684 1091.3903 1112.1637 1116.0821 1117.6252 1135.6352 1174.2740 1189.9827 1217.2414 1263.8191 1277.1242 1310.1657 1325.2529 1328.0944 1346.6206 1376.5540 1380.8399 1390.8195 1395.8721 1398.6424 1400.4547 1428.7296 1463.8944 1464.1852 1466.2422 1468.6576 1469.4923 1471.4152 1478.2408 1478.8772 1480.6491 1487.5424 1488.7750 1605.1385 1622.0472 2911.1017 2970.3499 2971.0747 2974.0047 2977.7494 2980.4847 3034.0326 3048.1536 3062.1816 3071.6410 3073.2886 3075.0119 3076.9069 3077.2673 3081.1071 3081.6261 3085.8230 3110.3327 3114.6969 3557.7910
redmass: 2.6174 2.5084 1.0752 3.7102 2.8542 3.2377 3.0264 2.6708 1.0636 1.0610 1.5116 1.1288 1.4527 3.3510 3.3708 2.7029 1.1690 2.7711 2.7712 5.1091 2.6879 5.2310 3.9945 2.9456 2.9632 2.8926 4.3058 4.9940 4.0147 3.4489 2.7487 1.4643 1.3692 1.1765 1.2073 2.1755 3.3437 1.4532 1.4151 1.4068 1.5397 1.4452 1.6575 2.7089 2.6070 2.5229 1.5617 2.2093 1.9472 1.6143 1.5690 1.3741 3.1302 1.9606 1.2836 1.6169 1.1956 1.1922 2.0940 1.2632 1.3680 1.2808 2.6739 1.0805 2.8151 1.0435 1.0519 1.0503 1.0497 1.0508 1.0498 1.1098 1.0898 1.1081 6.4015 6.0119 1.0811 1.0377 1.0348 1.0353 1.0350 1.0355 1.0862 1.0966 1.0999 1.1001 1.0981 1.1002 1.0989 1.0996 1.0985 1.1004 1.0997 1.0903 1.0908 1.0650
irintensity: 0.0079 0.0180 0.4139 0.5454 1.8835 0.6100 0.5774 0.3398 0.2428 0.0360 0.0191 0.1355 0.0196 2.7281 2.5655 7.3618 95.9214 2.4344 3.1052 1.3722 1.8128 1.2884 4.9779 1.8170 2.0277 9.2478 0.4039 24.6062 6.6048 2.9792 1.1799 19.9549 0.3349 2.2766 1.9202 13.4607 1.4371 0.0713 0.0256 17.2677 11.5076 24.9060 3.7450 71.0572 5.0670 0.2059 99.4588 5.9056 48.6303 0.0605 31.8141 1.0106 5.7930 6.7378 0.4873 8.4293 15.0882 17.3052 8.8275 4.6393 21.0957 7.3010 4.2983 5.6706 64.6844 2.3383 3.9913 1.1252 13.4763 24.8189 13.0054 0.9523 28.8385 18.2036 2.4114 0.8571 57.0850 47.1549 33.8102 45.7454 29.3585 35.7047 1.9804 23.1910 0.1400 0.9674 105.7211 24.7426 21.7275 81.5878 41.8258 21.0518 37.0354 32.6383 10.8881 22.5230
temp: 298.150 k
press: 1.00000 atm
elementType: 8 6 6 6 6 6 6 6 6 6 6 6 6 6 1 1 1 1 1 1 1 1 1 1 1 1 1 1 1 1 1 1 1 1
symmnumber: 1
zpe: 774150.2 jmol-1
zpe.correction: 0.294858 hartree
zpe.thermalcorrener: 0.311405 hartree
zpe.thermalcorrenthalpy: 0.312349 hartree
zpe.thermalcorrgfe: 0.250085 hartree
zpe.sumelectzpe: -581.526032 hartree
zpe.sumelectthermal: -581.509486 hartree
zpe.sumelectthermalent: -581.508541 hartree
zpe.sumelectthermalfe: -581.570806 hartree
dipole: -1.7916 0.1548 0.0332
dipole: 1.7986
quadrupole: -80.0656 -82.2197 -89.9587
quadrupole: 4.3225 -0.0066 0.0931
quadrupole: 4.0157 1.8616 -5.8774 4.3225 -0.0066 0.0931
hfenergy: -581.8208904 hartree
pointgroup: C01 [X(C13H20O1)]
dipole: -0.704889 -0.0611937 -0.0103793 debye
polarizability: 179.4069767|-1.1461156|154.4597791|-0.2035713|-0.5037504|102.9547628 unknown
InChI: InChI=1S/C13H20O/c1-8(2)11-6-10(5)7-12(9(3)4)13(11)14/h6-9,14H,1-5H3
charge 0 multiplicity 1
34 atoms
O  0.105697 2.297604 -0.060796
C  -2.581192 0.936799 -0.023023
C  2.586213 0.937163 -0.03918
C  -1.233882 0.200273 -0.016533
C  1.253115 0.182585 -0.025394
C  0.014698 0.883003 -0.034599
C  -1.210461 -1.216878 0.008663
C  1.213425 -1.228843 -0.000105
C  -0.004839 -1.952598 0.014184
C  -3.402779 0.635816 1.259058
C  -3.398856 0.615254 -1.302838
C  3.409512 0.603992 -1.3120
C  3.410051 0.648225 1.244101
C  -0.009742 -3.472582 0.020923
H  -2.413589 2.037974 -0.030587
H  2.35649 2.016742 -0.057864
H  -2.162936 -1.762356 0.024063
H  2.160813 -1.783685 0.008795
H  -2.836821 0.905935 2.168362
H  -4.353931 1.200279 1.256449
H  -3.64726 -0.439959 1.323493
H  -3.642066 -0.461727 -1.350122
H  -4.350242 1.179251 -1.312617
H  -2.83016 0.870579 -2.214755
H  3.675878 -0.469162 -1.348681
H  4.349825 1.186609 -1.327772
H  2.839289 0.842995 -2.22772
H  2.841637 0.922342 2.151071
H  4.352382 1.227789 1.237667
H  3.672741 -0.423795 1.319672
H  0.692724 -3.877306 0.772963
H  -1.013443 -3.872411 0.248648
H  0.295186 -3.882849 -0.961547
H  -0.799479 2.697343 -0.065678
