program: Gaussian 09
title: 000096600
version: EM64L-G09RevD.01
frameworkgroup: C1[X(C5H5N5)]
method: RPBEPBE
basis: SDD
operation: Freq
keyword: #p
keyword: freq=noraman
keyword: PBEPBE/SDD
title: #p freq=noraman PBEPBE/SDD
converged: NO NO NO NO
title: Mulliken charges:
elementType: N N N N N C C C C C H H H H H
charge: -0.429886 0.001713 -0.012785 -0.067432 -0.626150 0.143037 0.033432 0.198442 -0.365834 -0.375552 0.325949 0.277090 0.244223 0.311292 0.342462
chargesum: 0.00000
title: Mulliken charges with hydrogens summed into heavy atoms:
elementType: N N N N N C C C C C
charge: -0.103938 0.001713 -0.012785 -0.067432 0.027603 0.143037 0.033432 0.198442 -0.088744 -0.131329
polarizability: 1.13203123e+02 2.12008574e+00 1.04185753e+02 -7.18979654e-05 -9.33775098e-05 3.62206028e+01
1716.lowfreq: -7.8845 -0.0003 -0.0003 0.0006 10.0721 12.2222 138.7052 193.0355 272.8836
frequency: 138.6882 193.0313 272.8825 290.9988 325.8793 485.4283 504.8868 506.5868 535.6001 569.8675 585.9337 625.4852 667.8824 679.3774 785.3787 845.7370 851.5536 906.4502 932.0692 959.8545 1036.2801 1107.0343 1184.7411 1215.0592 1277.6885 1306.2126 1332.8841 1361.0811 1375.5939 1423.2470 1455.1056 1529.8499 1590.2299 1629.9310 3166.9259 3244.6563 3544.8247 3620.1614 3701.0800
redmass: 3.2924 6.0169 3.6122 4.0888 1.3738 3.9525 8.4420 1.6225 1.1599 3.9247 6.6179 3.2456 4.2542 7.4968 4.1633 1.5686 8.3273 4.4662 1.4217 2.0687 5.1811 4.7053 1.9910 2.1671 3.9515 5.9533 2.0722 5.1324 4.1793 1.8196 2.6319 6.2789 2.5866 1.8672 1.0920 1.0985 1.0458 1.0822 1.1039
irintensity: 3.0158 1.1306 2.8087 9.9687 103.6184 1.3457 1.4532 50.5978 234.2448 7.2861 3.8537 0.4758 52.0187 3.9737 0.0001 34.0109 16.9246 29.6950 15.1913 8.6562 20.6635 0.2237 0.4687 8.1185 12.2096 14.3763 6.3851 55.7405 31.3037 18.0931 34.1770 125.5820 28.6834 435.8271 19.1159 0.1948 94.9990 66.9348 35.0060
temp: 298.150 k
press: 1.00000 atm
elementType: 7 7 7 7 7 6 6 6 6 6 1 1 1 1 1
symmnumber: 1
zpe: 285705.1 jmol-1
zpe.correction: 0.108819 hartree
zpe.thermalcorrener: 0.116296 hartree
zpe.thermalcorrenthalpy: 0.117240 hartree
zpe.thermalcorrgfe: 0.076866 hartree
zpe.sumelectzpe: -466.569840 hartree
zpe.sumelectthermal: -466.562364 hartree
zpe.sumelectthermalent: -466.561420 hartree
zpe.sumelectthermalfe: -466.601794 hartree
dipole: -1.4584 -5.0975 0.0001
dipole: 5.3021
quadrupole: -60.9251 -47.7351 -60.1692
quadrupole: 5.7061 0.0002 -0.0002
quadrupole: -4.6486 8.5414 -3.8927 5.7061 0.0002 -0.0002
hfenergy: -466.6786595 hartree
pointgroup: C01 [X(C5H5N5)]
dipole: 0.3814847 2.0508174 0.0000532 debye
dipolederiv: -0.3057901 -0.1527311 0.0000204 0.1186416 -0.5346236 0.0000126 -0.0000141 0.0000046 -0.2247303 -0.3015294 0.2971199 0.0000036 0.2778026 0.2891302 -0.0000065 0.0000066 0.0000143 -0.2088963 -0.5827649 0.113167 -0.0000026 -0.0743744 -0.5352581 0. 0.0000036 0.0000078 -0.2016293 -0.4734455 0.2060158 0.0000027 -0.2554682 -0.9440227 0.0000005 -0.0000077 -0.0000098 -0.2390242 -0.4270055 -0.4984746 -0.0000152 -0.6147594 -1.2479652 0.0000065 -0.0000112 0.0000048 -0.7341997 -0.289562 -0.601513 -0.0000093 -0.4365699 -0.1557589 -0.0000096 0.0000124 -0.000018 0.0571973 0.3170665 -0.3363067 0.0000008 0.0450503 0.2275188 0.0000069 0.0000016 0.0000022 0.0499356 0.7237926 0.5697811 0.000001 0.6468141 1.5789636 0.0000067 -0.0000012 0.0000117 0.2471579 0.199478 0.3537651 -0.0000012 0.048932 -0.0557574 -0.0000077 0.000004 -0.0000006 -0.118633 0.5603636 -0.0439884 -0.0000033 0.1290278 0.6831516 -0.0000037 0.0000132 -0.0000072 -0.0670979 0.167817 -0.0527171 -0.000007 -0.0329618 0.2191948 -0.0000018 -0.0000053 -0.0000108 0.3505437 0.0498962 -0.045128 -0.0000005 -0.0442451 0.0594173 0.0000023 -0.0000011 0.0000026 0.1824545 0.0035752 0.0995523 0.0000008 0.0846993 -0.012506 -0.0000003 -0.0000091 0.0000065 0.1306676 0.1201802 0.0337906 0.0000062 0.0619997 0.229486 -0.0000028 0.0000059 -0.000004 0.3907523 0.237928 0.0576671 0.0000036 0.0454115 0.1990295 -0.0000033 0.0000024 -0.000004 0.3855019 unknown
polarizability: 112.7230837|2.931385|104.6657923|0.0000627|0.0000998|36.2206028 unknown
InChI: InChI=1S/C5H5N5/c6-5-4-3(1-9-10-4)7-2-8-5/h1-2,10H,6H2
charge 0 multiplicity 1
15 atoms
N  -1.383238 1.312645 -0.000106
N  -2.530944 0.519854 -0.000155
N  0.227986 -1.886823 -0.000093
N  2.046898 -0.236546 -0.000114
N  1.7335 2.086697 -0.000092
C  -0.219151 0.551672 -0.000075
C  -0.646427 -0.818869 -0.000092
C  1.185876 0.821045 -0.000097
C  -2.084219 -0.764623 -0.000101
C  1.530596 -1.513402 -0.000121
H  -1.506071 2.321937 -0.000088
H  -2.795384 -1.58706 -0.000086
H  2.272801 -2.317145 -0.000102
H  1.171759 2.932787 -0.000068
H  2.749917 2.155931 -0.00011
