program: Gaussian 09
title: 000096795
version: EM64L-G09RevD.01
frameworkgroup: C1[X(C20H23NO12)]
method: RPBEPBE
basis: SDD
operation: Freq
keyword: #p
keyword: freq=noraman
keyword: PBEPBE/SDD
title: #p freq=noraman PBEPBE/SDD
converged: YES YES NO NO
title: Mulliken charges:
elementType: O O O O O O O O O O O O N C C C C C C C C C C C C C C C C C C C C H H H H H H H H H H H H H H H H H H H H H H H
charge: -0.232166 -0.258518 -0.269638 -0.280308 -0.237406 -0.269980 -0.236777 -0.268981 -0.224288 -0.253014 -0.214713 -0.213928 0.022520 -0.118356 -0.092704 -0.079115 -0.081491 -0.092675 -0.373987 0.320127 0.344854 0.382575 0.313398 -0.771861 -0.766198 0.321153 -0.761417 -0.286578 -0.362447 -0.361401 -0.333646 -0.752931 0.377789 0.279532 0.327161 0.318016 0.234505 0.225039 0.282342 0.239399 0.251108 0.245784 0.274244 0.286198 0.240747 0.252599 0.252600 0.249468 0.252477 0.280811 0.272443 0.286249 0.290595 0.271493 0.248327 0.250972
chargesum: 0.00000
title: Mulliken charges with hydrogens summed into heavy atoms:
elementType: O O O O O O O O O O O O N C C C C C C C C C C C C C C C C C C C C
charge: -0.232166 -0.258518 -0.269638 -0.280308 -0.237406 -0.269980 -0.236777 -0.268981 -0.224288 -0.253014 -0.214713 -0.213928 0.022520 0.161176 0.234457 0.238901 0.153014 0.132364 0.147755 0.320127 0.344854 0.382575 0.313398 -0.000726 0.013346 0.321153 -0.006873 -0.005767 -0.090004 -0.075152 -0.043051 0.017861 0.377789
polarizability: 3.71311041e+02 1.16655786e+01 2.44469909e+02 -1.83829388e+00 2.60196782e+01 2.13121332e+02
1716.lowfreq: -4.1608 -1.1794 -0.0005 0.0002 0.0004 2.1216 15.6713 20.8152 25.1988
frequency: 15.6161 20.7614 25.1414 26.6298 29.0951 31.0848 34.0774 42.2240 51.5928 58.6220 65.7962 70.6749 72.8130 75.4584 82.5139 86.3138 92.9557 102.4518 116.6596 119.0514 122.2504 149.6166 160.6719 162.6627 170.1293 191.2883 207.6094 220.1764 226.5114 251.1867 267.4453 275.9189 296.7704 304.0161 336.5748 362.0380 373.7921 389.2143 407.0759 416.1248 447.6590 467.3347 480.5636 485.6436 495.6781 512.7319 542.4294 550.8595 557.2580 562.7311 564.3288 585.2170 596.5982 608.5278 614.4312 627.0962 628.9531 642.3721 650.3573 663.7335 691.7037 731.7053 760.3737 791.3477 814.3034 822.4305 827.2204 831.1744 856.8122 857.8129 873.1430 917.4384 945.2197 962.4128 965.8696 974.2707 976.6577 988.4599 990.0529 996.1705 998.1909 1000.5985 1004.9669 1008.9726 1014.2748 1041.6032 1045.0813 1045.9333 1048.9122 1055.4449 1091.7483 1095.8580 1110.8221 1111.5675 1132.6552 1155.5598 1168.1613 1178.1932 1181.5188 1184.5841 1202.5562 1215.5771 1224.3282 1226.1587 1234.2546 1260.5742 1269.9123 1285.9504 1293.1456 1307.2190 1321.7652 1336.0050 1351.3854 1354.3984 1357.0366 1360.2952 1370.5726 1383.6074 1383.9594 1385.2999 1387.0497 1407.5480 1432.0454 1452.1600 1452.5045 1452.9900 1454.2914 1454.5151 1455.1415 1455.8686 1456.8021 1467.5816 1477.3994 1593.6797 1610.9528 1650.0554 1657.8876 1662.7801 1679.6373 2925.0176 2948.8353 3004.2433 3004.6425 3004.6496 3009.7051 3010.7484 3047.9689 3054.0596 3067.5345 3098.0094 3100.1073 3100.4544 3100.7432 3124.5929 3142.7456 3143.5229 3143.8920 3145.7387 3170.4956 3172.4052 3188.4298 3191.5388
redmass: 6.5193 6.1815 1.7138 2.8468 5.7180 7.0179 5.8410 5.2485 5.2981 6.6238 5.2581 5.5946 3.2140 5.5635 3.4806 3.8294 1.1026 4.1270 4.2457 1.0562 1.1795 7.4760 7.1713 6.5206 8.9275 7.0190 6.1011 6.6313 4.8139 7.6967 6.5456 5.5716 3.3450 6.3477 5.3614 4.8341 5.3012 4.8422 3.8020 3.0133 3.9161 4.8616 4.5735 4.9822 3.2336 5.6386 4.5994 3.2090 3.3424 3.3314 3.3577 4.9877 5.5131 5.3602 4.3636 5.7314 5.3400 5.2837 5.4209 4.5609 5.0470 4.9104 8.4993 5.2083 6.1059 1.8162 2.5638 5.5309 1.6443 5.4658 3.7217 4.8204 6.5680 4.1174 3.9994 1.4040 2.5231 1.3678 2.8511 2.3094 2.9582 2.1320 2.5239 2.9819 3.4707 1.6590 1.6594 1.6436 1.6548 4.3591 2.8295 3.1557 1.2935 2.9636 3.2202 2.3605 1.5394 2.9088 3.2239 2.8735 2.7790 1.4959 2.4822 5.3031 1.4337 1.2310 1.2584 1.2247 1.2833 1.2638 1.3100 1.5121 1.4202 1.9835 1.3712 2.8237 1.5808 1.2410 1.2440 1.2635 1.2360 8.4263 4.1982 1.0571 1.0558 1.0567 1.0566 1.0474 1.0549 1.0530 1.0566 1.0822 2.4549 7.7098 6.7294 9.7150 9.6049 10.0826 9.9278 1.0832 1.0836 1.0395 1.0387 1.0387 1.0369 1.0831 1.0567 1.0845 1.0847 1.0972 1.0936 1.0928 1.0936 1.1091 1.1026 1.1028 1.1024 1.1011 1.0895 1.0887 1.0964 1.0975
irintensity: 0.6277 0.1452 1.2189 1.3888 1.4470 0.7015 0.6194 1.8410 0.2235 0.3270 5.3698 1.1558 1.0194 0.0432 10.0804 1.3295 0.2941 1.7011 1.2741 0.8408 0.5927 3.4013 3.7668 7.5523 3.4616 7.3925 8.6043 3.7887 4.0179 0.9009 0.9070 2.5616 10.8849 2.4669 4.9773 12.7856 12.1909 2.2614 0.1826 0.0964 1.1590 7.4479 21.3316 13.6137 6.6838 5.4314 15.2966 11.8533 9.9745 5.0627 0.8801 4.8288 10.1654 2.3192 10.8768 6.4202 4.5166 33.0315 15.4572 19.2117 9.2227 8.1903 2.4476 29.2621 43.7156 12.5048 31.5278 20.7866 67.7150 21.6806 13.6289 93.6996 137.5739 50.6572 236.7933 5.9805 19.0927 7.7235 258.0414 30.4449 4.8108 38.1150 302.3605 62.2294 156.1425 17.3310 22.5467 12.3438 13.7176 18.2721 12.6503 30.3917 24.1997 11.0737 19.7031 55.6774 324.3897 237.9670 31.2538 324.8717 875.0438 234.8683 77.6147 109.4683 2.5084 5.8668 8.7887 12.7085 0.6963 6.9649 14.6920 0.3517 0.7098 40.4912 13.7463 57.7101 42.0958 113.8475 15.5595 59.3629 73.4482 33.1768 17.3040 9.9575 26.3606 21.5686 17.9458 19.1198 14.2300 11.5266 26.8280 17.1950 89.7291 55.4144 195.5612 126.2570 149.8439 191.0451 168.3848 28.3330 31.0349 0.8606 0.1391 1.3192 1.3392 13.3331 23.7724 5.5892 12.1175 6.0976 5.4835 9.5278 1.7477 6.4680 7.2600 4.1693 9.2749 8.4695 0.4818 1.6773 0.4500 6.1487
temp: 298.150 k
press: 1.00000 atm
elementType: 8 8 8 8 8 8 8 8 8 8 8 8 7 6 6 6 6 6 6 6 6 6 6 6 6 6 6 6 6 6 6 6 6 1 1 1 1 1 1 1 1 1 1 1 1 1 1 1 1 1 1 1 1 1 1 1
symmnumber: 1
zpe: 1092964.0 jmol-1
zpe.correction: 0.416288 hartree
zpe.thermalcorrener: 0.450777 hartree
zpe.thermalcorrenthalpy: 0.451721 hartree
zpe.thermalcorrgfe: 0.343375 hartree
zpe.sumelectzpe: -1730.818111 hartree
zpe.sumelectthermal: -1730.783622 hartree
zpe.sumelectthermalent: -1730.782678 hartree
zpe.sumelectthermalfe: -1730.891024 hartree
dipole: 5.6493 2.0333 -1.5779
dipole: 6.2080
quadrupole: -243.9982 -176.8837 -196.5367
quadrupole: -17.1209 1.3383 1.4438
quadrupole: -38.1920 28.9225 9.2695 -17.1209 1.3383 1.4438
hfenergy: -1731.2343992 hartree
pointgroup: C01 [X(C20H23N1O12)]
dipole: -2.358317 0.2629203 0.5784082 debye
polarizability: 368.8792138|21.306155|242.5865934|4.6386881|-27.7616239|217.4364746 unknown
InChI: InChI=1S/C20H23NO12/c1-10(22)28-9-16-17(29-11(2)23)18(30-12(3)24)19(31-13(4)25)20(33-16)32-15-7-5-14(6-8-15)21(26)27/h5-8,16-20H,9H2,1-4H3
charge 0 multiplicity 1
56 atoms
O  0.49064 -0.780691 0.011172
O  -3.185512 1.312485 0.195405
O  -2.254157 -1.110593 -0.970705
O  -0.667095 2.764202 0.305359
O  1.543381 1.200612 -0.671497
O  -1.562449 -3.638129 1.134199
O  -4.090554 0.908552 2.309879
O  -4.487448 -1.53732 -0.430305
O  -1.018314 3.510271 -1.889234
O  -2.435571 -4.453627 -0.879406
O  7.52792 -0.09893 1.186851
O  7.896065 1.398537 -0.496203
N  7.112338 0.693022 0.252296
C  -1.921771 0.710159 0.661119
C  -1.961685 -0.81588 0.450808
C  -0.780293 1.359019 -0.127971
C  -0.59202 -1.432846 0.7827
C  0.553022 0.669791 0.228808
C  -0.491075 -2.917249 0.404109
C  -4.246032 1.299242 1.134074
C  -3.576106 -1.488957 -1.286601
C  2.904527 1.007809 -0.385302
C  -0.799523 3.764914 -0.690891
C  -5.520466 1.774204 0.48835
C  -3.676291 -1.859528 -2.742096
C  -2.505321 -4.355232 0.364439
C  -0.630994 5.12614 -0.058506
C  3.39293 0.131603 0.617287
C  3.792385 1.76227 -1.192199
C  4.780119 0.034647 0.827638
C  5.176487 1.659575 -0.98838
C  -3.584848 -4.921422 1.253205
C  5.65702 0.799878 0.028028
H  -1.808137 0.909464 1.745512
H  -2.751729 -1.254013 1.086131
H  -0.954278 1.305434 -1.217154
H  -0.411861 -1.296939 1.872684
H  0.832487 0.879656 1.287727
H  -0.61467 -3.048563 -0.68285
H  0.470487 -3.336521 0.739296
H  -5.318532 2.543541 -0.272917
H  -6.21245 2.154152 1.254479
H  -5.990945 0.909338 -0.015567
H  -3.299088 -2.892773 -2.857275
H  -4.726098 -1.825108 -3.067956
H  -3.053319 -1.197022 -3.363043
H  0.389211 5.226477 0.351506
H  -0.804117 5.908424 -0.810936
H  -1.335684 5.247209 0.781537
H  2.707978 -0.494964 1.192845
H  3.375429 2.417013 -1.962204
H  5.195756 -0.630289 1.589162
H  5.888226 2.229299 -1.590853
H  -4.419312 -4.19637 1.295371
H  -3.969279 -5.858435 0.822256
H  -3.215783 -5.086036 2.276319
