program: Gaussian 09
title: 000096622
version: EM64L-G09RevD.01
frameworkgroup: C1[X(C9H12N2O6)]
method: RPBEPBE
basis: SDD
operation: Freq
keyword: #p
keyword: freq=noraman
keyword: PBEPBE/SDD
title: #p freq=noraman PBEPBE/SDD
converged: YES YES NO NO
title: Mulliken charges:
elementType: O O O O O O N N C C C C C C C C C H H H H H H H H H H H H
charge: -0.250976 -0.427992 -0.440642 -0.273617 -0.419879 -0.283053 -0.185786 -0.377302 -0.128779 0.002551 -0.548000 -0.046447 -0.376948 -0.186388 0.212477 0.117260 0.078950 0.215064 0.286084 0.238169 0.284751 0.289556 0.209726 0.217167 0.341105 0.349465 0.362080 0.358242 0.383159
chargesum: 0.00000
title: Mulliken charges with hydrogens summed into heavy atoms:
elementType: O O O O O O N N C C C C C C C C C
charge: -0.250976 -0.086887 -0.082400 -0.273617 -0.036720 -0.283053 -0.185786 -0.015221 0.086284 0.288635 -0.025080 0.243109 0.049945 0.163077 0.212477 0.117260 0.078950
polarizability: 1.73000567e+02 1.42944448e+01 1.42273221e+02 6.65516485e+00 -9.12995244e-01 7.89345988e+01
1716.lowfreq: -13.4348 -11.6344 -0.0008 -0.0004 0.0005 2.5844 35.5878 45.4934 71.2835
frequency: 35.4109 45.4627 71.2307 102.6340 120.6343 126.6163 166.1937 193.4192 199.6792 250.9052 281.5984 289.8739 294.5503 307.0552 326.7333 346.6460 384.6606 393.7781 413.9937 457.4678 472.3717 503.8103 535.7953 551.6894 619.6405 676.5302 694.3892 714.7684 715.9216 742.6050 761.8237 767.2582 804.4382 841.6597 861.2753 927.0882 935.6104 944.9474 973.0966 988.1497 1036.1017 1045.1048 1053.1035 1070.6510 1085.2502 1156.7032 1175.1820 1186.0406 1200.3146 1204.5978 1219.6307 1222.4653 1248.8889 1254.4766 1268.5516 1289.1414 1308.9571 1335.2692 1338.1971 1365.5590 1380.5446 1381.2265 1410.3423 1443.9179 1456.9638 1467.4909 1602.9920 1628.7533 1672.0470 2933.2688 2972.7315 2988.7502 3034.6888 3065.9519 3096.2018 3106.8121 3147.3056 3423.7280 3528.3576 3567.7876 3575.2486
redmass: 5.4341 5.8572 7.3917 4.7111 5.7880 6.6461 4.5033 6.8782 3.7005 5.6623 4.3813 1.2399 1.3077 3.6207 6.1418 4.6983 11.5647 5.7700 4.5561 2.9173 7.7282 2.9898 1.0886 5.2185 4.7356 4.5240 2.4722 5.8891 5.5985 7.2175 4.9709 2.1890 3.5033 3.3597 3.2363 1.5153 2.3249 2.4363 5.0160 2.0374 3.0149 3.0771 3.4480 2.4165 2.9283 1.2637 1.4136 2.8411 1.5941 2.5044 1.6930 1.4360 1.2739 1.4462 1.5156 1.3784 1.4076 1.2434 1.6137 1.4017 1.5396 2.4685 1.4868 3.4479 1.0906 1.0782 7.5593 6.2262 6.3926 1.0557 1.0858 1.1040 1.0645 1.0884 1.0885 1.1015 1.0961 1.0641 1.0772 1.0663 1.0667
irintensity: 3.3522 2.2148 2.9475 4.5787 3.4595 7.4992 5.5024 3.0820 12.3291 3.9702 20.1003 69.7983 223.3945 41.9759 24.7978 11.5204 5.0890 2.4121 11.9254 3.1794 3.1094 30.4337 126.5866 29.2355 11.2514 2.6889 10.8885 8.1984 18.1383 4.1190 3.2408 121.6505 19.7572 22.4008 21.9967 42.5247 56.6385 22.9589 67.5195 17.5119 85.5381 60.4816 60.9914 42.0359 5.9633 73.4569 6.0091 1.8655 59.6316 8.3492 271.9054 97.5070 8.1768 17.7175 198.9225 6.2686 12.9122 0.6027 50.3904 23.7122 6.3321 38.9992 0.9557 26.0879 13.1148 7.9558 366.7472 493.6949 132.6403 41.1207 47.2222 73.8791 14.0171 7.2993 12.6918 13.5246 78.4730 80.2347 61.8926 8.4683 9.9677
temp: 298.150 k
press: 1.00000 atm
elementType: 8 8 8 8 8 8 7 7 6 6 6 6 6 6 6 6 6 1 1 1 1 1 1 1 1 1 1 1 1
symmnumber: 1
zpe: 572955.7 jmol-1
zpe.correction: 0.218227 hartree
zpe.thermalcorrener: 0.234131 hartree
zpe.thermalcorrenthalpy: 0.235075 hartree
zpe.thermalcorrgfe: 0.174766 hartree
zpe.sumelectzpe: -909.702139 hartree
zpe.sumelectthermal: -909.686236 hartree
zpe.sumelectthermalent: -909.685292 hartree
zpe.sumelectthermalfe: -909.745601 hartree
dipole: -3.5140 0.2258 4.2987
dipole: 5.5568
quadrupole: -107.5720 -97.9075 -98.9225
quadrupole: 2.1340 -12.0387 5.3541
quadrupole: -6.1047 3.5598 2.5449 2.1340 -12.0387 5.3541
hfenergy: -909.9203668 hartree
pointgroup: C01 [X(C9H12N2O6)]
dipole: 1.410455 -0.0882927 1.668016 debye
polarizability: 169.1591035|18.067345|145.3174287|-6.4925366|6.0892723|79.7318554 unknown
InChI: InChI=1S/C9H12N2O6/c12-3-6-4(13)1-7(17-6)11-2-5(14)8(15)10-9(11)16/h2,4,6-7,10,12-14H,1,3H2
charge 0 multiplicity 1
29 atoms
O  1.737591 -0.09453 -1.110824
O  4.083156 1.478366 -0.037213
O  1.917114 -2.792701 -0.299321
O  -1.028057 2.687072 0.312883
O  -2.46858 -2.611426 -0.297298
O  -4.313489 -0.686204 0.468389
N  -0.433234 0.478642 -0.223642
N  -2.659764 0.994782 0.375589
C  3.097861 0.678765 0.699828
C  0.974497 0.968594 -0.491976
C  1.717163 1.373863 0.813757
C  2.803317 -0.552525 -0.177689
C  2.362994 -1.769535 0.650391
C  -0.783111 -0.867623 -0.399717
C  -1.348356 1.470617 0.161449
C  -2.07018 -1.283943 -0.15753
C  -3.108211 -0.33376 0.251177
H  3.49564 0.398732 1.697838
H  0.884878 1.804272 -1.204528
H  1.166654 1.001757 1.69561
H  1.79119 2.468779 0.904296
H  3.661865 -0.811626 -0.816434
H  1.54468 -1.496097 1.352056
H  3.235341 -2.120402 1.24243
H  4.179758 2.363188 0.39711
H  0.011188 -1.537266 -0.744922
H  -3.347384 1.702957 0.651421
H  1.651132 -3.612087 0.188381
H  -3.448253 -2.63956 -0.098309
