program: Gaussian 09
title: 000096582
version: EM64L-G09RevD.01
frameworkgroup: C1[X(C9H3Cl2NO2)]
method: RPBEPBE
basis: SDD
operation: Freq
keyword: #p
keyword: freq=noraman
keyword: PBEPBE/SDD
title: #p freq=noraman PBEPBE/SDD
converged: YES YES YES YES
title: Mulliken charges:
elementType: Cl Cl O O N C C C C C C C C C H H H
charge: 0.086521 0.094198 -0.156470 -0.110155 0.053323 0.360808 -0.191434 0.106284 0.180590 -0.257885 -0.248255 -0.227974 -0.160229 -0.337191 0.297697 0.247691 0.262484
chargesum: 0.00000
title: Mulliken charges with hydrogens summed into heavy atoms:
elementType: Cl Cl O O N C C C C C C C C C
charge: 0.086521 0.094198 -0.156470 -0.110155 0.053323 0.360808 -0.191434 0.106284 0.180590 0.039811 -0.248255 -0.227974 0.087462 -0.074707
polarizability: 1.84657119e+02 1.45701771e+00 1.63811603e+02 1.32782588e-02 -2.52126714e-03 4.63578334e+01
1716.lowfreq: -0.0033 -0.0025 -0.0022 4.8933 6.0220 7.2091 47.9132 68.9944 104.1680
frequency: 47.9027 68.9944 104.1663 163.5146 195.7538 211.2388 270.6850 275.0621 322.7078 340.8017 367.0754 390.5694 429.1279 462.0013 514.6782 534.0455 619.2001 694.8873 705.7992 737.1264 785.6377 825.3957 831.9857 857.8926 874.8745 969.3171 1012.9076 1025.0327 1061.4928 1100.7813 1123.2520 1195.1927 1254.8978 1288.0816 1325.7661 1412.9382 1428.1420 1530.6184 1553.1586 1566.8033 1569.5523 1591.4073 3143.9712 3160.6129 3178.6833
redmass: 11.4010 15.2326 6.4194 8.2698 30.5949 10.6281 7.7527 9.8345 16.4607 17.3542 11.9786 5.7291 4.5650 13.8987 6.0185 10.0619 8.6103 9.4403 4.2249 5.5486 10.7749 11.2704 1.6002 8.2849 5.8655 1.4508 1.4022 4.1540 3.4382 3.9489 2.3864 1.8963 4.2328 2.5583 9.5786 2.7022 2.1588 7.5773 9.4840 8.2316 10.1371 10.2246 1.0894 1.0916 1.1002
irintensity: 3.8490 0.3486 2.6223 1.2166 0.0045 1.0405 1.1083 1.3907 0.4056 1.5807 11.1819 0.4256 0.8234 7.3727 0.5891 0.9577 18.8221 1.7570 22.5478 19.8196 110.1893 14.0581 28.6451 29.3465 1.8388 0.1784 1.0206 1.6435 2.9634 39.4194 112.7444 47.3841 159.5700 28.8259 2.0629 5.4535 4.7065 60.2766 206.5704 100.9370 22.7220 95.7245 7.9497 3.8004 15.5908
temp: 298.150 k
press: 1.00000 atm
elementType: 17 17 8 8 7 6 6 6 6 6 6 6 6 6 1 1 1
symmnumber: 1
zpe: 257937.2 jmol-1
zpe.correction: 0.098243 hartree
zpe.thermalcorrener: 0.109545 hartree
zpe.thermalcorrenthalpy: 0.110489 hartree
zpe.thermalcorrgfe: 0.059594 hartree
zpe.sumelectzpe: -1469.082079 hartree
zpe.sumelectthermal: -1469.070778 hartree
zpe.sumelectthermalent: -1469.069834 hartree
zpe.sumelectthermalfe: -1469.120729 hartree
dipole: 3.4285 2.1729 0.0015
dipole: 4.0591
quadrupole: -73.9182 -110.2611 -91.6308
quadrupole: 6.7826 0.0027 0.0000
quadrupole: 18.0185 -18.3244 0.3059 6.7826 0.0027 0.0000
hfenergy: -1469.1803225 hartree
pointgroup: C01 [X(C9H3Cl2N1O2)]
dipole: -1.3371775 0.873065 -0.0006069 debye
dipolederiv: -0.5704943 -0.4144836 0.0000119 -0.3333509 -0.2302046 0.0000098 0.0000299 0.0000029 0.0235944 -0.5574513 0.4272065 0.0000231 0.3410002 -0.2455626 -0.0000181 0.0000125 0.0000189 0.0286912 -0.548788 0.0432469 -0.0000249 -0.0179561 -0.9150811 -0.0000819 -0.0000403 -0.0001453 -0.2885121 -0.4810478 0.0086203 -0.0000423 -0.0143861 -0.8260112 0.0002093 0.0000135 0.0001388 -0.257385 -0.490719 -0.1100558 -0.0001006 0.04124 -0.1869631 -0.000013 -0.0001696 -0.0000197 -0.2136699 -0.5816933 -0.2206705 -0.000127 -0.077218 -0.1822484 -0.0000709 -0.0001206 -0.0000176 0.057051 -0.0998204 0.2756226 0.0000557 0.0822002 0.0567338 0.0000314 0.000168 0.0000561 0.0556299 1.3055298 -0.3396046 0.0001245 -0.151295 1.0162838 0.0001815 0.0001515 0.0001541 0.2132049 1.1414928 0.2680232 0.0001029 0.187245 0.9564699 -0.0002803 -0.0000509 -0.0001757 0.2185253 0.046872 0.1123008 0.0000104 -0.1208683 0.1567608 -0.0000011 0.0000049 0.0000353 -0.0668309 0.2421865 1.0266026 -0.0000275 1.1371364 0.0390051 -0.000049 -0.000148 -0.0000149 -0.0413184 0.2134761 -0.9931594 -0.0000414 -1.1033626 0.1576918 0.0000623 0.0000962 0.0000029 -0.0497489 0.0201625 -0.1575614 0.0000029 -0.2568305 -0.1617381 -0.0000377 -0.0000666 -0.0000761 -0.0888809 0.3367907 0.1133245 0.0001291 0.2609479 0.2023288 0.0000886 0.0001663 0.0000619 -0.0349889 0.1390907 -0.04903 -0.0000074 0.0241617 0.0274857 -0.0000044 0.0000364 -0.0000146 0.1490141 -0.047857 0.0633852 -0.0000302 0.0781438 0.069665 0.0000059 -0.0000405 -0.0000033 0.1581881 -0.0677301 -0.0537674 -0.0000591 -0.0768078 0.0653843 -0.0000321 -0.0000428 -0.0000038 0.137436 unknown
polarizability: 184.6138308|-1.7387895|163.8548912|0.0133112|0.0023412|46.3578334 unknown
InChI: InChI=1S/C9H3Cl2NO2/c10-5-6(11)9(14)7-4(8(5)13)2-1-3-12-7/h1-3H
charge 0 multiplicity 1
17 atoms
Cl 3.293872 1.601292 0.000006
Cl 3.244372 -1.673245 -0.000109
O  0.53625 2.749318 0.000471
O  0.474385 -2.756637 0.00066
N  -1.985543 -1.408083 -0.000534
C  -0.779191 0.72613 -0.000091
C  -0.820337 -0.695473 -0.000177
C  0.508614 1.485183 0.000071
C  0.460177 -1.499794 0.000243
C  -2.003742 1.439038 -0.000222
C  1.764132 0.67025 0.000022
C  1.741629 -0.703512 -0.000012
C  -3.210235 0.713625 -0.000544
C  -3.151725 -0.704015 -0.00074
H  -1.978533 2.532986 -0.000098
H  -4.178206 1.223121 -0.000672
H  -4.068519 -1.303684 -0.001074
