program: Gaussian 09
title: 000096578
version: EM64L-G09RevD.01
frameworkgroup: C1[X(C12H10N2O)]
method: RPBEPBE
basis: SDD
operation: Freq
keyword: #p
keyword: freq=noraman
keyword: PBEPBE/SDD
title: #p freq=noraman PBEPBE/SDD
converged: NO NO NO NO
title: Mulliken charges:
elementType: O N N C C C C C C C C C C C C H H H H H H H H H H
charge: -0.279089 -0.405953 -0.093201 0.140620 0.208300 0.216633 -0.377803 0.265708 -0.376043 -0.356521 -0.250198 -0.216582 -0.445007 0.220021 -0.756732 0.260294 0.310381 0.267381 0.228930 0.222432 0.253035 0.222965 0.241935 0.256577 0.241918
chargesum: 0.00000
title: Mulliken charges with hydrogens summed into heavy atoms:
elementType: O N N C C C C C C C C C C C C
charge: -0.279089 -0.095573 -0.093201 0.140620 0.208300 0.216633 -0.117508 0.265708 -0.108662 -0.127591 -0.027766 0.006383 -0.191972 0.220021 -0.016302
polarizability: 2.24838294e+02 -3.27464852e+00 1.68238284e+02 -1.25665119e-02 -7.75542897e-03 6.29178486e+01
1716.lowfreq: -0.0007 0.0004 0.0007 3.1345 5.8116 12.3606 29.2713 84.8515 87.7136
frequency: 28.7291 84.8377 87.7130 116.9561 179.6370 217.0989 246.8073 259.1799 323.3579 368.2059 382.5668 423.9555 488.5896 532.5488 569.3947 573.7161 614.5784 625.0845 643.6570 667.4045 678.0511 754.0324 758.8895 769.9521 798.9446 810.5850 860.2348 863.8694 874.7807 892.8570 942.1599 963.9491 981.8356 990.9505 1012.1331 1047.6420 1089.7572 1103.4906 1129.9007 1144.1912 1167.6433 1195.3086 1244.7506 1255.1968 1263.8744 1312.5033 1332.5229 1383.3537 1401.2617 1417.5440 1454.8218 1457.4888 1463.4534 1479.7173 1506.5119 1551.0947 1585.0448 1613.3654 1635.1277 2989.3647 3065.6656 3124.4368 3124.9731 3137.2411 3156.6449 3180.1067 3226.8254 3241.0326 3608.4662
redmass: 4.3040 4.5981 4.5961 1.0673 4.4852 3.9769 4.1426 4.1764 5.6628 6.5715 3.9513 2.9043 4.5223 1.3032 6.2394 2.7871 3.4748 6.6480 4.7942 3.0964 5.1326 1.2978 5.4885 3.5925 1.6949 1.4496 1.4618 5.4438 5.9501 7.8992 1.3724 2.4955 1.3062 4.2710 2.1392 1.4472 2.9058 1.8663 1.8089 1.6341 1.1173 4.7771 1.7244 1.8573 2.8151 2.9828 2.0610 3.5544 1.2380 2.7321 3.9441 1.0440 1.1159 2.7250 5.1669 6.5788 6.3138 8.4418 7.1640 1.0383 1.0980 1.0976 1.0856 1.0910 1.0973 1.0962 1.0981 1.0984 1.0809
irintensity: 1.5222 1.0112 0.1234 0.2481 1.2779 9.3223 4.4638 2.5868 0.1045 0.7633 2.2845 12.3192 2.0765 90.0781 0.1217 13.1889 3.4704 2.4974 3.0512 1.4130 2.9292 117.9477 3.7140 2.0472 6.6977 49.3323 0.4906 5.0662 12.7322 22.9055 3.4353 2.9260 0.1340 29.8534 14.0908 5.0757 5.3912 52.5768 16.0701 4.4121 0.4736 6.0259 17.0805 7.4039 21.8713 9.9709 21.4979 43.4557 7.3453 12.6806 26.2807 18.0813 17.8093 4.8609 3.1632 42.8835 0.6581 72.6550 16.2502 23.9262 14.1940 5.2281 0.2152 19.7695 30.6384 8.7292 0.4874 9.0676 84.7124
temp: 298.150 k
press: 1.00000 atm
elementType: 8 7 7 6 6 6 6 6 6 6 6 6 6 6 6 1 1 1 1 1 1 1 1 1 1
symmnumber: 1
zpe: 505288.1 jmol-1
zpe.correction: 0.192454 hartree
zpe.thermalcorrener: 0.204453 hartree
zpe.thermalcorrenthalpy: 0.205397 hartree
zpe.thermalcorrgfe: 0.153358 hartree
zpe.sumelectzpe: -646.965002 hartree
zpe.sumelectthermal: -646.953003 hartree
zpe.sumelectthermalent: -646.952059 hartree
zpe.sumelectthermalfe: -647.004098 hartree
dipole: 2.9918 1.2125 0.0008
dipole: 3.2282
quadrupole: -82.4031 -69.0665 -92.3671
quadrupole: 14.3378 -0.0048 -0.0004
quadrupole: -1.1242 12.2124 -11.0882 14.3378 -0.0048 -0.0004
hfenergy: -647.1574562 hartree
pointgroup: C01 [X(C12H10N2O1)]
dipole: -1.1545997 0.5290867 -0.0003083 debye
dipolederiv: -0.6159212 -0.0910714 -0.0001448 -0.03122 -0.5111514 -0.0002358 -0.000046 -0.0002981 -0.0999802 -1.0532028 0.3705443 -0.0000051 -0.2081695 -0.4371726 0.0000354 0.0001806 -0.0000292 -0.2705477 -0.4088089 -0.0959632 -0.0000977 0.1131978 -0.4062608 -0.0001138 0.0001129 -0.0001141 -0.2429022 0.2046967 0.3125844 -0.0000759 0.182314 -0.0575168 -0.0000042 0.0000305 -0.0000013 -0.0036999 -0.1507259 -0.01745 0.000054 0.3285926 -0.1776693 -0.0000852 0.0000362 0.0000283 -0.0547139 -0.1750157 -0.0494879 0.0000269 0.5083258 0.4298364 -0.0000759 -0.0001088 -0.0000567 0.0433111 0.740399 -0.4423799 -0.0000243 -0.380899 -0.0076205 -0.000015 -0.0001933 -0.0000003 -0.1509747 0.8306817 0.0328413 0.0000233 -0.1112717 0.1971796 0.0001136 0.0001166 0.000046 0.0794746 0.0034309 -0.0280547 -0.000009 -0.0115896 0.0538982 -0.0000253 -0.000043 -0.0000212 -0.1408646 0.0853088 -0.0232105 -0.0000195 -0.0356982 -0.0088985 -0.0000228 -0.0000204 -0.0000231 -0.1922192 -0.094977 -0.0548349 0.000003 -0.0599519 0.0995794 -0.0000282 -0.0000123 -0.0000203 -0.1864718 0.0472135 0.0121244 -0.0000178 -0.0389632 -0.0503369 -0.0000056 -0.0000114 -0.0000192 -0.1744551 -0.2382452 0.0954296 0.000129 -0.2781269 0.1559803 0.0002584 -0.0000982 0.0002605 -0.1942 0.4474771 -0.0489991 0.0000767 -0.1116261 0.5812425 0.0003317 -0.0003643 0.0006441 0.036742 0.0114292 0.0240467 -0.0000627 0.1129234 -0.105499 -0.0000438 0.0003511 -0.0003937 0.0826766 0.0688036 -0.0539009 0.0000193 -0.057238 0.004398 0.0000476 0.000013 0.0000558 0.2015134 0.16797 -0.0182664 0.0000128 -0.0733898 0.2271341 0.0000232 0.0000562 0.0000201 0.3414081 0.0362919 0.086182 -0.0000021 0.0686692 0.0535965 0.0000108 0.0000027 -0.0000024 0.1546678 -0.0622246 0.0735537 0.0000059 0.1194105 0.0111896 0.0000116 -0.0000067 0.0000174 0.1764012 0.0744186 -0.0137675 0.0000099 -0.038413 -0.1376068 0.0000393 0.0000177 0.0000354 0.1635349 0.1221952 0.0270517 -0.0000114 0.0486609 -0.0344705 -0.0001644 -0.0000402 -0.000178 0.1940987 -0.1048738 -0.091539 0.0000296 -0.1021779 0.0420668 0.0000218 0.0000353 0.0000198 0.1628792 0.0714537 -0.0043448 -0.0656768 0.0643343 -0.0057151 -0.0772959 -0.0049466 -0.116389 -0.0296451 -0.079096 0.0038394 -0.0002823 -0.0715675 0.0898068 -0.0001647 -0.000395 -0.0000183 0.1328166 0.0713213 -0.0049273 0.0660389 0.0638741 -0.00599 0.0773873 0.0053333 0.1164375 -0.0288499 unknown
polarizability: 225.0175607|0.7380418|168.0590179|-0.0122079|0.0083085|62.9178486 unknown
InChI: InChI=1S/C12H10N2O/c1-8-13-7-12(15-8)10-6-14-11-5-3-2-4-9(10)11/h2-7,14H,1H3
charge 0 multiplicity 1
25 atoms
O  1.846313 -0.724489 -0.000958
N  -1.965804 2.067483 -0.000345
N  3.725798 0.581009 0.000077
C  -1.09999 -0.050719 -0.000127
C  0.002764 0.907029 -0.000294
C  -2.322032 0.710702 -0.000133
C  -0.573903 2.186278 -0.000479
C  1.421983 0.631118 -0.000239
C  -1.174626 -1.468874 0.00004
C  -3.596909 0.103795 0.000021
C  -2.443622 -2.080264 0.0002
C  -3.641625 -1.304739 0.000189
C  2.578488 1.408106 0.000406
C  3.269745 -0.667891 -0.000712
C  4.01726 -1.955907 -0.001432
H  -0.092327 3.162391 -0.000725
H  -2.618444 2.848443 -0.000422
H  -0.259593 -2.066628 0.000029
H  -4.518027 0.697587 0.000007
H  -2.517395 -3.173639 0.000332
H  2.672758 2.490447 0.00124
H  -4.612437 -1.813134 0.000318
H  3.777805 -2.562212 -0.894291
H  5.095606 -1.735164 0.000314
H  3.775315 -2.564625 0.889083
