program: Gaussian 09
title: 000096573
version: EM64L-G09RevD.01
frameworkgroup: C1[X(C8H17N3O)]
method: RPBEPBE
basis: SDD
operation: Freq
keyword: #p
keyword: freq=noraman
keyword: PBEPBE/SDD
title: #p freq=noraman PBEPBE/SDD
converged: NO YES NO NO
title: Mulliken charges:
elementType: O N N N C C C C C C C C H H H H H H H H H H H H H H H H H
charge: -0.263790 -0.410174 -0.214891 -0.614126 0.268947 -0.465652 -0.446800 -0.474572 -0.492576 0.160504 -0.342927 -0.689849 0.220707 0.186081 0.183091 0.217232 0.216389 0.245210 0.272505 0.208095 0.247986 0.236624 0.208423 0.226997 0.319319 0.354124 0.220298 0.204445 0.218380
chargesum: 0.00000
title: Mulliken charges with hydrogens summed into heavy atoms:
elementType: O N N N C C C C C C C C
charge: -0.263790 -0.162188 0.021733 0.059317 0.268947 -0.058864 -0.046476 -0.012973 -0.011976 0.160504 0.092493 -0.046727
polarizability: 1.22588916e+02 1.89276908e+00 1.02494734e+02 3.91023472e+00 1.04391783e+00 9.77329715e+01
1716.lowfreq: -3.2079 -0.0007 0.0003 0.0006 8.4503 14.4326 61.3746 72.2032 126.4949
frequency: 61.3654 72.1910 126.4888 128.9733 144.9251 178.5597 230.7043 261.1786 271.7883 295.5015 328.6028 366.6738 373.8764 419.6217 461.9728 502.5443 533.5278 571.3302 622.4929 655.5333 669.1275 693.7612 733.9509 764.8176 796.1069 811.1799 840.2054 894.1220 920.4570 933.4954 982.8895 986.1781 1002.3310 1053.4864 1065.4366 1082.0666 1106.2933 1122.5439 1133.8745 1158.5771 1166.0611 1185.9767 1241.5586 1250.2113 1271.6362 1292.3485 1311.1994 1329.2102 1340.7817 1346.1775 1358.6205 1361.9210 1391.7856 1437.8363 1444.4800 1453.7798 1457.7854 1458.7095 1468.8322 1471.8357 1478.1941 1498.1870 1519.5846 1632.5614 2927.6040 2945.0173 2956.6089 2978.8496 2999.7747 3007.8367 3020.9897 3034.4275 3036.5269 3061.4842 3072.2871 3085.8965 3088.6236 3409.9061 3417.7556 3427.6657 3642.7034
redmass: 4.8924 2.7126 2.5428 3.4833 2.3513 2.9258 1.4049 2.3005 2.0711 3.7932 2.9185 1.7505 2.9129 3.9369 3.0263 2.3406 2.4044 1.2665 2.1894 2.1518 2.0625 2.2309 3.6224 1.0624 1.5388 1.1357 2.2959 2.1945 2.0078 1.9757 1.6422 2.0237 2.6831 2.6719 2.2052 2.5454 2.7927 1.6091 3.8314 1.1821 3.5047 2.3097 1.4350 1.4240 1.2442 1.7833 1.3022 1.7165 1.2512 1.3318 1.3173 1.2936 1.2363 1.1042 1.1857 1.1560 1.0893 1.0985 1.1013 1.0702 1.0492 1.0920 1.2886 7.2414 1.0683 1.0646 1.0637 1.0368 1.0612 1.0647 1.0915 1.0944 1.0963 1.1051 1.0986 1.1014 1.1000 1.0740 1.0725 1.0511 1.0988
irintensity: 3.2498 1.6886 0.9025 0.2089 0.5226 0.0514 3.2308 12.3675 5.7331 0.0299 11.9097 19.4121 5.5880 1.9659 3.8991 4.6946 1.5899 160.2226 29.4201 78.2574 104.0728 60.3257 51.9161 68.1769 1.4751 2.7473 10.4732 7.8211 1.2229 9.6840 7.5892 12.0053 13.7921 7.0043 10.8711 0.9018 4.7330 14.1061 62.0311 3.7320 39.1963 6.3109 3.8197 23.9003 18.7374 18.3662 2.6010 32.8077 8.7555 7.4205 4.0732 4.7775 18.3630 14.4971 7.2345 11.3558 1.6971 15.1594 20.6719 12.8956 6.7155 13.7133 136.9360 252.5860 53.6765 29.1936 53.3381 33.4877 40.5109 57.2504 11.1381 60.0162 20.6106 28.6847 51.5193 10.8341 40.5988 4.1285 2.6230 57.8142 61.2107
temp: 298.150 k
press: 1.00000 atm
elementType: 8 7 7 7 6 6 6 6 6 6 6 6 1 1 1 1 1 1 1 1 1 1 1 1 1 1 1 1 1
symmnumber: 1
zpe: 667767.4 jmol-1
zpe.correction: 0.254339 hartree
zpe.thermalcorrener: 0.267047 hartree
zpe.thermalcorrenthalpy: 0.267991 hartree
zpe.thermalcorrgfe: 0.216099 hartree
zpe.sumelectzpe: -553.553470 hartree
zpe.sumelectthermal: -553.540762 hartree
zpe.sumelectthermalent: -553.539818 hartree
zpe.sumelectthermalfe: -553.591710 hartree
dipole: 3.9375 -2.2160 2.4276
dipole: 5.1291
quadrupole: -79.9245 -69.4730 -74.4263
quadrupole: 4.8667 -3.5538 3.7288
quadrupole: -5.3166 5.1350 0.1816 4.8667 -3.5538 3.7288
hfenergy: -553.8078095 hartree
pointgroup: C01 [X(C8H17N3O1)]
dipole: 1.47597 -0.8837283 1.0548219 debye
polarizability: 122.2505278|1.4209968|102.4599401|5.0654779|0.8562214|98.106153 unknown
InChI: InChI=1S/C8H17N3O/c1-2-11-8(7(9)12)3-5-10-6-4-8/h10-11H,2-6,9H2,1H3
charge 0 multiplicity 1
29 atoms
O  -0.645618 1.902756 -1.201894
N  1.378327 -0.462567 0.687228
N  -2.899737 -0.857642 0.02427
N  1.065095 2.149981 0.360293
C  0.019017 -0.065856 0.189306
C  -0.937293 -0.098298 1.427109
C  -0.539624 -1.000858 -0.929034
C  -2.42622 0.112851 1.037393
C  -2.064319 -0.818296 -1.199668
C  0.111404 1.414438 -0.309283
C  2.421311 -0.755071 -0.332423
C  3.772329 -1.031852 0.349357
H  -0.607707 0.656891 2.16611
H  -0.840608 -1.097524 1.906043
H  -0.352594 -2.048057 -0.606893
H  0.012562 -0.838435 -1.87412
H  -3.06218 0.032511 1.938082
H  -2.565006 1.128461 0.623056
H  -2.219791 0.157104 -1.689141
H  -2.413558 -1.609126 -1.889621
H  1.302348 -1.233379 1.367294
H  -2.953045 -1.809502 0.417259
H  2.153716 -1.61601 -0.984765
H  2.508238 0.130045 -0.990826
H  1.184487 3.139738 0.152315
H  1.670238 1.630177 1.006907
H  4.090434 -0.166715 0.958039
H  3.710857 -1.912717 1.01719
H  4.554935 -1.236651 -0.403083
