program: Gaussian 09
title: 000096558
version: EM64L-G09RevD.01
frameworkgroup: C1[X(C8H15N3O2)]
method: RPBEPBE
basis: SDD
operation: Freq
keyword: #p
keyword: freq=noraman
keyword: PBEPBE/SDD
title: #p freq=noraman PBEPBE/SDD
converged: NO YES NO NO
title: Mulliken charges:
elementType: O O N N N C C C C C C C C H H H H H H H H H H H H H H H
charge: -0.276116 -0.249720 -0.408815 -0.160703 0.031512 -0.046359 -0.417385 -0.446269 -0.400282 -0.414275 -0.377304 0.333225 -0.626662 0.254649 0.236882 0.198169 0.204300 0.219366 0.204675 0.206162 0.211671 0.192399 0.193815 0.205800 0.345834 0.254973 0.275721 0.254736
chargesum: 0.00000
title: Mulliken charges with hydrogens summed into heavy atoms:
elementType: O O N N N C C C C C C C C
charge: -0.276116 -0.249720 -0.062981 -0.160703 0.031512 0.208290 0.017665 -0.022604 0.010555 -0.010204 0.022311 0.333225 0.158769
polarizability: 1.37328381e+02 3.77701475e+00 1.19803252e+02 4.26357832e+00 7.89444458e-01 8.62463602e+01
1716.lowfreq: -14.2630 0.0003 0.0004 0.0007 9.2235 12.8709 27.9256 59.7357 81.7276
frequency: 26.6355 59.0989 81.6969 95.7478 138.4200 160.0149 187.7283 223.4651 235.8901 284.4591 319.3328 365.4576 376.7079 394.1419 435.4576 458.3299 482.2463 493.6555 637.4571 667.7691 707.5121 742.9508 778.8042 795.7151 832.8220 835.1742 861.3841 879.4745 921.4208 934.8174 976.6639 1013.4155 1046.9368 1053.8532 1089.6288 1114.9839 1116.7211 1125.0992 1152.4627 1166.8396 1195.9297 1245.0839 1259.1507 1260.8718 1274.9941 1304.3013 1329.7746 1332.5304 1338.6124 1351.0384 1355.0228 1357.1821 1369.5149 1412.7501 1458.4917 1462.5775 1462.7972 1468.0080 1473.5992 1475.0216 1478.7409 1495.9584 1665.9458 2959.0047 2968.5395 2973.8689 2979.8498 2984.4722 3004.3658 3025.0625 3030.4106 3033.6850 3039.5915 3045.6339 3052.5966 3089.0320 3146.2047 3499.7930
redmass: 4.2636 4.3175 3.8497 4.7876 1.1112 3.8313 3.9533 2.6301 5.1300 2.7940 3.2018 1.9822 3.0466 5.6007 4.2469 3.0123 3.2241 2.7882 2.3456 1.1478 9.7816 5.1722 1.4945 3.9354 2.3964 2.4229 2.3543 2.3539 1.8665 1.7834 2.4853 2.7728 1.5486 1.6218 1.7351 1.0474 1.3256 2.6198 1.9424 2.1193 2.3481 1.3276 1.2715 2.5578 1.4571 1.7479 1.4178 1.4134 1.4313 1.4399 4.7091 1.7141 1.3311 1.1854 1.0924 1.0459 1.1071 1.1872 1.0942 1.0936 1.2117 1.3495 10.1852 1.0672 1.0626 1.0628 1.0632 1.0621 1.0335 1.0860 1.0955 1.0946 1.1009 1.1017 1.1015 1.1009 1.1010 1.0771
irintensity: 0.0144 0.0462 0.2106 12.4404 0.9003 1.7716 2.5153 0.6797 11.4274 10.4472 12.7953 3.2252 4.4655 1.7672 1.5895 3.8348 1.3821 1.0071 6.7901 74.1601 21.9551 36.4045 0.2069 5.0321 1.1243 15.3740 7.7013 32.5793 109.9272 100.8170 24.4793 0.9417 2.5782 1.7657 0.2824 2.8158 0.6112 46.9667 12.4372 33.2234 5.5996 9.6745 3.2393 12.7643 4.6219 11.0616 5.0255 9.5304 0.5530 4.3481 126.1934 16.7303 4.2368 35.2256 26.7394 20.6349 11.7882 110.4736 47.4610 3.6844 133.2397 234.8984 243.0026 24.7465 38.0952 29.2615 21.6330 24.2271 15.1112 39.9847 73.4344 42.1525 26.2784 37.3092 82.0372 13.8515 0.2664 36.7467
temp: 298.150 k
press: 1.00000 atm
elementType: 8 8 7 7 7 6 6 6 6 6 6 6 6 1 1 1 1 1 1 1 1 1 1 1 1 1 1 1
symmnumber: 1
zpe: 615660.5 jmol-1
zpe.correction: 0.234493 hartree
zpe.thermalcorrener: 0.247732 hartree
zpe.thermalcorrenthalpy: 0.248677 hartree
zpe.thermalcorrgfe: 0.193905 hartree
zpe.sumelectzpe: -627.486541 hartree
zpe.sumelectthermal: -627.473301 hartree
zpe.sumelectthermalent: -627.472357 hartree
zpe.sumelectthermalfe: -627.527128 hartree
dipole: -2.3885 -0.2256 -0.2634
dipole: 2.4135
quadrupole: -72.9495 -90.8675 -76.4052
quadrupole: -5.8265 1.1587 -1.3972
quadrupole: 7.1246 -10.7934 3.6688 -5.8265 1.1587 -1.3972
hfenergy: -627.7210332 hartree
pointgroup: C01 [X(C8H15N3O2)]
dipole: -0.9409982 -0.0842341 -0.0951775 debye
polarizability: 137.4439129|3.8937341|119.5507024|3.8727347|-2.330906|86.3833773 unknown
InChI: InChI=1S/C8H15N3O2/c1-11(10-13)8(12)9-7-5-3-2-4-6-7/h7,9H,2-6H2,1H3
charge 0 multiplicity 1
28 atoms
O  1.263033 -2.120936 0.002048
O  3.23211 2.040179 0.05505
N  0.015231 -0.173143 -0.390958
N  2.345623 -0.023089 0.039474
N  2.162272 1.348487 -0.086573
C  -1.287171 -0.855384 -0.580097
C  -1.968661 -1.175985 0.779255
C  -2.203516 0.025003 -1.465045
C  -2.45079 0.099361 1.509702
C  -2.694517 1.300249 -0.73287
C  -3.381128 0.947796 0.609031
C  1.156987 -0.868771 -0.114454
C  3.663794 -0.6168 0.315075
H  -1.070455 -1.808924 -1.096617
H  -1.26772 -1.755151 1.408313
H  -2.837556 -1.834295 0.574307
H  -3.083503 -0.585992 -1.746835
H  -1.679096 0.28706 -2.404187
H  -1.573873 0.708307 1.811638
H  -2.974713 -0.181261 2.443321
H  -3.391294 1.856281 -1.388541
H  -1.844098 1.988253 -0.538757
H  -4.308439 0.374437 0.400631
H  -3.686621 1.872282 1.135511
H  0.085133 0.84761 -0.446037
H  4.369785 -0.36109 -0.493959
H  3.523766 -1.704992 0.379269
H  4.067219 -0.216991 1.261401
