program: Gaussian 09
title: 000096555
version: EM64L-G09RevD.01
frameworkgroup: C1[X(C6H10BrNO3)]
method: RPBEPBE
basis: SDD
operation: Freq
keyword: #p
keyword: freq=noraman
keyword: PBEPBE/SDD
title: #p freq=noraman PBEPBE/SDD
converged: YES YES NO NO
title: Mulliken charges:
elementType: Br O O O N C C C C C C H H H H H H H H H H
charge: -0.043286 -0.296622 -0.226417 -0.264092 -0.371942 -0.425457 0.246706 -0.218556 0.314875 -0.668480 -0.749187 0.278313 0.278477 0.370178 0.236005 0.236232 0.218766 0.233548 0.233631 0.308642 0.308666
chargesum: 0.00000
title: Mulliken charges with hydrogens summed into heavy atoms:
elementType: Br O O O N C C C C C C
charge: -0.043286 -0.296622 -0.226417 -0.264092 -0.001764 0.131333 0.246706 0.253682 0.314875 0.017464 -0.131880
polarizability: 1.07402829e+02 7.52223069e-01 1.26821510e+02 1.79333846e-02 3.79987993e-03 5.59516116e+01
1716.lowfreq: -0.0006 0.0000 0.0004 0.9248 5.8053 7.0889 21.3261 34.3140 47.2691
frequency: 21.1638 34.2908 47.2513 50.3220 67.8556 116.7384 144.7000 190.2984 204.7786 251.4788 253.8882 317.5825 351.4464 456.5456 539.0177 561.2024 566.6101 631.2140 659.2038 691.7568 798.6994 802.9905 872.7350 906.1773 954.0348 978.5752 1024.0216 1112.5474 1118.3727 1137.5397 1146.4801 1200.0098 1215.1239 1229.3788 1243.1220 1251.4746 1332.4467 1360.2496 1402.8946 1414.6531 1459.7774 1465.0888 1474.2066 1486.0713 1495.0655 1600.8793 1656.1098 2996.1973 2997.1632 3017.8643 3036.7175 3069.3662 3077.2574 3094.1168 3109.8039 3150.8866 3505.6484
redmass: 4.0109 2.6288 6.7267 4.4639 3.6516 6.0892 2.3369 2.2031 7.5912 1.2595 6.6704 10.8056 3.7950 6.3979 2.7746 5.1034 3.3210 5.5086 4.5044 1.1223 1.0980 4.0719 1.7205 5.3933 5.1963 2.0393 2.5469 2.4917 5.1760 1.4696 1.1345 4.8274 1.0821 1.2473 1.5199 1.1290 1.5484 1.3923 1.2626 1.0989 1.0733 1.0397 1.0699 1.1025 2.2090 9.7316 10.8397 1.0597 1.0362 1.0583 1.1001 1.0567 1.1064 1.0985 1.1036 1.1087 1.0782
irintensity: 0.3132 1.2756 0.1149 8.6163 4.8378 0.5372 4.9546 11.5872 14.1677 1.8800 4.3546 3.2800 13.6670 15.6616 0.4435 2.7282 6.8244 72.1715 21.3078 90.8930 4.8490 10.2835 17.1928 32.4074 22.5983 1.8122 86.9916 5.4368 21.0726 6.2085 0.0465 306.4211 0.1019 25.0882 38.3897 0.0723 0.7551 0.6689 19.3212 39.9914 11.8907 13.0708 11.0743 1.6063 367.9154 214.4764 205.9735 14.8866 15.6905 16.2046 4.5529 2.5327 3.3575 28.7869 42.9860 0.0746 82.3416
temp: 298.150 k
press: 1.00000 atm
elementType: 35 8 8 8 7 6 6 6 6 6 6 1 1 1 1 1 1 1 1 1 1
symmnumber: 1
zpe: 420793.0 jmol-1
zpe.correction: 0.160272 hartree
zpe.thermalcorrener: 0.173374 hartree
zpe.thermalcorrenthalpy: 0.174318 hartree
zpe.thermalcorrgfe: 0.116522 hartree
zpe.sumelectzpe: -527.668880 hartree
zpe.sumelectthermal: -527.655777 hartree
zpe.sumelectthermalent: -527.654833 hartree
zpe.sumelectthermalfe: -527.712629 hartree
dipole: -1.0954 -3.4914 0.0068
dipole: 3.6592
quadrupole: -76.8786 -83.7765 -72.7095
quadrupole: 8.9993 -0.0296 0.0039
quadrupole: 0.9096 -5.9883 5.0787 8.9993 -0.0296 0.0039
hfenergy: -527.8291514 hartree
pointgroup: C01 [X(C6H10Br1N1O3)]
dipole: 0.6262243 1.2962879 -0.0065364 debye
dipolederiv: -0.1952463 -0.0646694 -0.0022583 0.1574525 -0.6775444 0.0406956 -0.0132772 0.0214403 -0.1343287 -0.7351004 -0.2651819 -0.0268794 -0.3202291 -1.4779877 0.0291097 -0.0240186 0.0345078 -0.2806592 -0.8998763 0.394159 -0.0684757 0.0387067 -0.75181 0.0237039 -0.0514956 0.0541538 -0.3245476 -0.7710508 0.1602093 -0.0434089 -0.390551 -1.005241 -0.0019526 -0.0160587 0.0457778 -0.365838 -1.3040499 -0.0653238 -0.0750222 -0.172954 -0.4978155 -0.0099845 -0.069343 -0.0007702 -0.4067847 0.2103022 -0.2193937 0.0046377 -0.4558126 0.1109778 -0.0310012 0.0167791 -0.0104404 0.2903791 1.2340776 -0.295985 0.1018264 0.1975737 1.6785823 -0.0525784 0.0780543 -0.0949429 0.2146314 0.510599 0.3818461 -0.0045295 0.2954536 0.6438487 0.0121366 -0.0003073 0.0185548 0.3530683 1.5553515 -0.2101725 0.1279356 0.5634714 0.8676687 0.0156185 0.0895196 -0.0514216 0.2080102 0.0283107 -0.0236538 -0.0016328 -0.0212574 -0.1413203 0.007926 -0.0023377 0.0070777 0.0626562 -0.1230143 0.3399775 -0.0342443 0.0004673 0.8486184 -0.0382777 -0.0173848 -0.0088151 0.0766516 0.0070793 -0.0185164 0.0101335 0.0903984 0.0600819 0.0626987 -0.0255835 0.063241 -0.0009409 0.0054328 -0.0079428 -0.0089959 0.1021021 0.0477084 -0.0507864 0.0153771 -0.0701611 0.0138015 0.3964451 -0.0062349 0.0082579 0.0092325 0.2429995 0.0038341 0.0075117 0.0024934 0.3057579 -0.016382 -0.0653189 -0.0496123 0.0003271 -0.0054177 0.0681395 -0.0866449 0.0346374 -0.0681593 -0.0414058 -0.0523284 0.0588763 0.0217764 -0.0161555 -0.0701699 0.0889282 -0.0486403 -0.0311227 -0.0814274 -0.1221899 -0.0126987 -0.0997647 -0.0021933 -0.0031487 -0.0136958 -0.0051551 0.1180053 0.0703727 0.0708934 -0.0965189 0.0204456 0.0766152 0.0167063 -0.0969372 0.040535 -0.0803159 0.0314558 0.088479 0.1088298 0.0346791 0.0713088 -0.024351 0.1145154 -0.0382663 -0.0353398 0.0481986 -0.0058043 0.0550695 -0.0359264 -0.0348231 0.0444191 0.0751586 -0.0065981 0.0517642 0.0699279 -0.0128483 -0.0512899 -0.0355915 -0.0381014 -0.0427377 -0.0687597 0.0127921 0.0333111 unknown
polarizability: 107.6586049|3.7533682|126.0419545|4.2885715|-3.1144594|56.4753911 unknown
InChI: InChI=1S/C6H10BrNO3/c1-2-11-6(10)4-8-5(9)3-7/h8H,2-4H2,1H3
charge 0 multiplicity 1
21 atoms
Br -2.807565 1.996591 -0.487899
O  1.43532 0.493606 -0.043264
O  2.585714 -1.528245 0.150472
O  -2.588891 -2.219692 -0.260058
N  -0.944872 -0.574596 -0.199378
C  0.141599 -1.546296 -0.056673
C  1.515754 -0.89557 0.02931
C  2.730526 1.246436 0.032496
C  -2.240409 -0.995431 -0.290606
C  2.388468 2.727972 -0.071666
C  -3.360514 0.035096 -0.438442
H  -0.003858 -2.168503 0.84761
H  0.147251 -2.256996 -0.905609
H  -0.701849 0.420593 -0.227215
H  3.217548 0.98554 0.988872
H  3.374583 0.895935 -0.793446
H  3.315901 3.326116 -0.014371
H  1.889928 2.954216 -1.02963
H  1.724266 3.040475 0.752136
H  -4.054183 -0.052244 0.410965
H  -3.899317 -0.140901 -1.381306
